{"text_format":"1","workbook":"xlsx","n_sheets":12,"sheets":["CustomerData","Report1Data","Language","Help","Lookup","Material1","Material2","Contact","Information","Customer","Report1","Report2"],"not_rendered":{"charts":0,"images":15,"macros":1,"external_links":0,"defined_names":21,"comments":0,"pivot_tables":0},"unopened":[],"bounds":{"document_bytes":16777216,"sheet_cells":100000,"rows_first":2000,"rows_last":500,"rows_between":2000,"halvings":0,"cell_chars":16384,"cell_head_chars":4096},"cells_cut":0,"cells_raw":0,"read":"whole","date_system":"1900"}

{"sheet":"CustomerData","index":0,"n_rows":2,"n_cols":9,"rows_kept":2,"cut":false,"hidden":true,"merged":[]}
["CustNo","CustomerName","Address","PostalCode","City","PersonName","Telephone","Email","RptType"]
[{"$f":"IF(Customer!E7=\"\",0,Customer!E7)","v":0},{"$f":"IF(Customer!E8=\"\",\"#N/A\",Customer!E8)","v":"#N/A"},{"$f":"IF(Customer!E9=\"\",\"#N/A\",Customer!E9)","v":"#N/A"},{"$f":"IF(Customer!E10=\"\",\"#N/A\",Customer!E10)","v":"#N/A"},{"$f":"IF(Customer!E11=\"\",\"#N/A\",Customer!E11)","v":"#N/A"},{"$f":"IF(Customer!E13=\"\",\"#N/A\",Customer!E13)","v":"#N/A"},{"$f":"IF(Customer!E14=\"\",\"#N/A\",Customer!E14)","v":"#N/A"},{"$f":"IF(Customer!E15=\"\",\"#N/A\",Customer!E15)","v":"#N/A"},{"$f":"Customer!C33","v":"XLS02A"}]

{"sheet":"Report1Data","index":1,"n_rows":300,"n_cols":13,"rows_kept":300,"cut":false,"hidden":true,"merged":[]}
[{"$f":"IF(Report1!D13=\"\",\"#N/A\",Report1!D13)","v":"CustNo"},{"$f":"IF(Report1!E13=\"\",\"#N/A\",Report1!E13)","v":"Material"},{"$f":"IF(Report1!F13=\"\",\"#N/A\",Report1!F13)","v":"MatType"},{"$f":"IF(Report1!G13=\"\",\"#N/A\",Report1!G13)","v":"UM"},{"$f":"IF(Report1!H13=\"\",\"#N/A\",Report1!H13)","v":"StockDate"},{"$f":"IF(Report1!I13=\"\",\"#N/A\",Report1!I13)","v":"StockQty"},"SalesPeriodFrom","SalesPeriodTo","SalesQty","BudgetPeriodFrom","BudgetPeriodTo","BudgetQty",{"$f":"IF(Report1!J13=\"\",\"#N/A\",Report1!J13)","v":"Status"}]
[{"$f":"IF(Report1!D14=\"\",0,Report1!D14)","v":0},{"$f":"IF(Report1!E14=\"\",\"#N/A\",Report1!E14)","v":"#N/A"},{"$f":"IF(Report1!F14=\"\",\"#N/A\",Report1!F14)","v":"#N/A"},{"$f":"IF(Report1!G14=\"\",\"#N/A\",Report1!G14)","v":"#N/A"},{"$f":"IF(Report1!H14=\"\",DATE(1900,1,1),Report1!H14)","v":"1900-01-01"},{"$f":"IF(Report1!I14=\"\",0,Report1!I14)","v":0},{"$f":"DATE(1900,1,1)","v":"1900-01-01"},"1900-01-01",0,{"$f":"DATE(1900,1,1)","v":"1900-01-01"},"1900-01-01",0,{"$f":"IF(Report1!J14=\"\",\"#N/A\",Report1!J14)","v":"#N/A"}]
[{"$f":"IF(Report1!D15=\"\",0,Report1!D15)","v":0},{"$f":"IF(Report1!E15=\"\",\"#N/A\",Report1!E15)","v":"#N/A"},{"$f":"IF(Report1!F15=\"\",\"#N/A\",Report1!F15)","v":"#N/A"},{"$f":"IF(Report1!G15=\"\",\"#N/A\",Report1!G15)","v":"#N/A"},{"$f":"IF(Report1!H15=\"\",DATE(1900,1,1),Report1!H15)","v":"1900-01-01"},{"$f":"IF(Report1!I15=\"\",0,Report1!I15)","v":0},"1900-01-01","1900-01-01",0,"1900-01-01","1900-01-01",0,{"$f":"IF(Report1!J15=\"\",\"#N/A\",Report1!J15)","v":"#N/A"}]
[{"$f":"IF(Report1!D16=\"\",0,Report1!D16)","v":0},{"$f":"IF(Report1!E16=\"\",\"#N/A\",Report1!E16)","v":"#N/A"},{"$f":"IF(Report1!F16=\"\",\"#N/A\",Report1!F16)","v":"#N/A"},{"$f":"IF(Report1!G16=\"\",\"#N/A\",Report1!G16)","v":"#N/A"},{"$f":"IF(Report1!H16=\"\",DATE(1900,1,1),Report1!H16)","v":"1900-01-01"},{"$f":"IF(Report1!I16=\"\",0,Report1!I16)","v":0},"1900-01-01","1900-01-01",0,"1900-01-01","1900-01-01",0,{"$f":"IF(Report1!J16=\"\",\"#N/A\",Report1!J16)","v":"#N/A"}]
[{"$f":"IF(Report1!D17=\"\",0,Report1!D17)","v":0},{"$f":"IF(Report1!E17=\"\",\"#N/A\",Report1!E17)","v":"#N/A"},{"$f":"IF(Report1!F17=\"\",\"#N/A\",Report1!F17)","v":"#N/A"},{"$f":"IF(Report1!G17=\"\",\"#N/A\",Report1!G17)","v":"#N/A"},{"$f":"IF(Report1!H17=\"\",DATE(1900,1,1),Report1!H17)","v":"1900-01-01"},{"$f":"IF(Report1!I17=\"\",0,Report1!I17)","v":0},"1900-01-01","1900-01-01",0,"1900-01-01","1900-01-01",0,{"$f":"IF(Report1!J17=\"\",\"#N/A\",Report1!J17)","v":"#N/A"}]
[{"$f":"IF(Report1!D18=\"\",0,Report1!D18)","v":0},{"$f":"IF(Report1!E18=\"\",\"#N/A\",Report1!E18)","v":"#N/A"},{"$f":"IF(Report1!F18=\"\",\"#N/A\",Report1!F18)","v":"#N/A"},{"$f":"IF(Report1!G18=\"\",\"#N/A\",Report1!G18)","v":"#N/A"},{"$f":"IF(Report1!H18=\"\",DATE(1900,1,1),Report1!H18)","v":"1900-01-01"},{"$f":"IF(Report1!I18=\"\",0,Report1!I18)","v":0},"1900-01-01","1900-01-01",0,"1900-01-01","1900-01-01",0,{"$f":"IF(Report1!J18=\"\",\"#N/A\",Report1!J18)","v":"#N/A"}]
[{"$f":"IF(Report1!D19=\"\",0,Report1!D19)","v":0},{"$f":"IF(Report1!E19=\"\",\"#N/A\",Report1!E19)","v":"#N/A"},{"$f":"IF(Report1!F19=\"\",\"#N/A\",Report1!F19)","v":"#N/A"},{"$f":"IF(Report1!G19=\"\",\"#N/A\",Report1!G19)","v":"#N/A"},{"$f":"IF(Report1!H19=\"\",DATE(1900,1,1),Report1!H19)","v":"1900-01-01"},{"$f":"IF(Report1!I19=\"\",0,Report1!I19)","v":0},"1900-01-01","1900-01-01",0,"1900-01-01","1900-01-01",0,{"$f":"IF(Report1!J19=\"\",\"#N/A\",Report1!J19)","v":"#N/A"}]
[{"$f":"IF(Report1!D20=\"\",0,Report1!D20)","v":0},{"$f":"IF(Report1!E20=\"\",\"#N/A\",Report1!E20)","v":"#N/A"},{"$f":"IF(Report1!F20=\"\",\"#N/A\",Report1!F20)","v":"#N/A"},{"$f":"IF(Report1!G20=\"\",\"#N/A\",Report1!G20)","v":"#N/A"},{"$f":"IF(Report1!H20=\"\",DATE(1900,1,1),Report1!H20)","v":"1900-01-01"},{"$f":"IF(Report1!I20=\"\",0,Report1!I20)","v":0},"1900-01-01","1900-01-01",0,"1900-01-01","1900-01-01",0,{"$f":"IF(Report1!J20=\"\",\"#N/A\",Report1!J20)","v":"#N/A"}]
[{"$f":"IF(Report1!D21=\"\",0,Report1!D21)","v":0},{"$f":"IF(Report1!E21=\"\",\"#N/A\",Report1!E21)","v":"#N/A"},{"$f":"IF(Report1!F21=\"\",\"#N/A\",Report1!F21)","v":"#N/A"},{"$f":"IF(Report1!G21=\"\",\"#N/A\",Report1!G21)","v":"#N/A"},{"$f":"IF(Report1!H21=\"\",DATE(1900,1,1),Report1!H21)","v":"1900-01-01"},{"$f":"IF(Report1!I21=\"\",0,Report1!I21)","v":0},"1900-01-01","1900-01-01",0,"1900-01-01","1900-01-01",0,{"$f":"IF(Report1!J21=\"\",\"#N/A\",Report1!J21)","v":"#N/A"}]
[{"$f":"IF(Report1!D22=\"\",0,Report1!D22)","v":0},{"$f":"IF(Report1!E22=\"\",\"#N/A\",Report1!E22)","v":"#N/A"},{"$f":"IF(Report1!F22=\"\",\"#N/A\",Report1!F22)","v":"#N/A"},{"$f":"IF(Report1!G22=\"\",\"#N/A\",Report1!G22)","v":"#N/A"},{"$f":"IF(Report1!H22=\"\",DATE(1900,1,1),Report1!H22)","v":"1900-01-01"},{"$f":"IF(Report1!I22=\"\",0,Report1!I22)","v":0},"1900-01-01","1900-01-01",0,"1900-01-01","1900-01-01",0,{"$f":"IF(Report1!J22=\"\",\"#N/A\",Report1!J22)","v":"#N/A"}]
[{"$f":"IF(Report1!D23=\"\",0,Report1!D23)","v":0},{"$f":"IF(Report1!E23=\"\",\"#N/A\",Report1!E23)","v":"#N/A"},{"$f":"IF(Report1!F23=\"\",\"#N/A\",Report1!F23)","v":"#N/A"},{"$f":"IF(Report1!G23=\"\",\"#N/A\",Report1!G23)","v":"#N/A"},{"$f":"IF(Report1!H23=\"\",DATE(1900,1,1),Report1!H23)","v":"1900-01-01"},{"$f":"IF(Report1!I23=\"\",0,Report1!I23)","v":0},"1900-01-01","1900-01-01",0,"1900-01-01","1900-01-01",0,{"$f":"IF(Report1!J23=\"\",\"#N/A\",Report1!J23)","v":"#N/A"}]
[{"$f":"IF(Report1!D24=\"\",0,Report1!D24)","v":0},{"$f":"IF(Report1!E24=\"\",\"#N/A\",Report1!E24)","v":"#N/A"},{"$f":"IF(Report1!F24=\"\",\"#N/A\",Report1!F24)","v":"#N/A"},{"$f":"IF(Report1!G24=\"\",\"#N/A\",Report1!G24)","v":"#N/A"},{"$f":"IF(Report1!H24=\"\",DATE(1900,1,1),Report1!H24)","v":"1900-01-01"},{"$f":"IF(Report1!I24=\"\",0,Report1!I24)","v":0},"1900-01-01","1900-01-01",0,"1900-01-01","1900-01-01",0,{"$f":"IF(Report1!J24=\"\",\"#N/A\",Report1!J24)","v":"#N/A"}]
[{"$f":"IF(Report1!D25=\"\",0,Report1!D25)","v":0},{"$f":"IF(Report1!E25=\"\",\"#N/A\",Report1!E25)","v":"#N/A"},{"$f":"IF(Report1!F25=\"\",\"#N/A\",Report1!F25)","v":"#N/A"},{"$f":"IF(Report1!G25=\"\",\"#N/A\",Report1!G25)","v":"#N/A"},{"$f":"IF(Report1!H25=\"\",DATE(1900,1,1),Report1!H25)","v":"1900-01-01"},{"$f":"IF(Report1!I25=\"\",0,Report1!I25)","v":0},"1900-01-01","1900-01-01",0,"1900-01-01","1900-01-01",0,{"$f":"IF(Report1!J25=\"\",\"#N/A\",Report1!J25)","v":"#N/A"}]
[{"$f":"IF(Report1!D26=\"\",0,Report1!D26)","v":0},{"$f":"IF(Report1!E26=\"\",\"#N/A\",Report1!E26)","v":"#N/A"},{"$f":"IF(Report1!F26=\"\",\"#N/A\",Report1!F26)","v":"#N/A"},{"$f":"IF(Report1!G26=\"\",\"#N/A\",Report1!G26)","v":"#N/A"},{"$f":"IF(Report1!H26=\"\",DATE(1900,1,1),Report1!H26)","v":"1900-01-01"},{"$f":"IF(Report1!I26=\"\",0,Report1!I26)","v":0},"1900-01-01","1900-01-01",0,"1900-01-01","1900-01-01",0,{"$f":"IF(Report1!J26=\"\",\"#N/A\",Report1!J26)","v":"#N/A"}]
[{"$f":"IF(Report1!D27=\"\",0,Report1!D27)","v":0},{"$f":"IF(Report1!E27=\"\",\"#N/A\",Report1!E27)","v":"#N/A"},{"$f":"IF(Report1!F27=\"\",\"#N/A\",Report1!F27)","v":"#N/A"},{"$f":"IF(Report1!G27=\"\",\"#N/A\",Report1!G27)","v":"#N/A"},{"$f":"IF(Report1!H27=\"\",DATE(1900,1,1),Report1!H27)","v":"1900-01-01"},{"$f":"IF(Report1!I27=\"\",0,Report1!I27)","v":0},"1900-01-01","1900-01-01",0,"1900-01-01","1900-01-01",0,{"$f":"IF(Report1!J27=\"\",\"#N/A\",Report1!J27)","v":"#N/A"}]
{"$rows_left_out":286}
{"sheet":"Language","index":2,"n_rows":85,"n_cols":7,"rows_kept":85,"cut":false,"hidden":true,"merged":[[1,0,1,5]]}
["Setup of file language (list must always be sorted by TextID)"]
["This list must always be sorted by TextID. If you add new columns to the list then please make sure that these new columns are included in the named are \"TextID\" (select Define Name from the Edit menu). Do not insert new rows on this sheet."]
[]
["Language column:","F",{"$f":"VLOOKUP(98,TextID,CODE(B4)-64)","v":"DE - 1010"}]
[]
[null,null,null,null,2000,1010,1080]
["TextID","Active","Sheet","Remark","EN","DE","IT"]
[98,"X","System","Language check","EN - 2000","DE - 1010","IT - 1080"]
[100,"X","System","Filename","VELUXstock_","VELUXlager_","Stock (magazzino) VELUX_"]
[102,null,"System","Material type","Standard","Standard","Standard"]
[104,null,"System","Material type","Roller shutter","Rollläden","persiane"]
[106,null,"System","Material UM","Pcs","Stück","pezzi"]
[108,"X","Contact","Button"," Customer master data (1)"," Kundenstammdaten (1)"," Dati del cliente (1)"]
[110,"X","Contact","Button"," Roof windows (2)"," Fenster (2)"," finestre (2)"]
[112,"X","Contact","Button"," Roller shutters (3)"," Rollläden (3)"," persiane (3)"]
{"$rows_left_out":71}
{"sheet":"Help","index":3,"n_rows":7,"n_cols":4,"rows_kept":7,"cut":false,"hidden":true,"merged":[]}
["Type","Title","Text (max 255 char)","Char"]
["Bestand Datum","Zählung am","Tragen Sie hier bitte das Datum ein, zu dem Sie Ihre Lagerbestände melden",{"$f":"LEN(C2)","v":73}]
["Absatz periode","Absatz im Zeitraum","Der Zeitraum ergibt sich aus dem Datum Ihrer Bestandsmeldung. Geben Sie bitte für den angegebenen Zeitraum den Absatz des Artikels an. (Diese Angabe ist freiwillig)",164]
["Vorhersage periode","Vorhersage für den Zeitraum","Der Zeitraum ergibt sich aus dem Datum Ihrer Bestandsmeldung. Geben Sie bitte für den angegebenen Zeitraum die  Absatzvorhersage für den Artikel an. (Diese Angabe ist freiwillig)",178]
["Premium Produkte","Meldeformular Optional","Mit diesem Formular können Sie zusätzlich Ihre Sonstige Fenster pro Artikelnummer melden. Diese Angaben sind nicht verpflichtend, um die Kriterien des Lagerbonus zu erfüllen",173]
[null,null,null,0]
[null,null,null,0]

{"sheet":"Lookup","index":4,"n_rows":242,"n_cols":4,"rows_kept":242,"cut":false,"hidden":true,"merged":[]}
["Text","Date",null,"Zähldatum"]
["1. Meldung (1. April)","1900-04-01",null,"2024-03-15"]
["2. Meldung (1. Juni)","1900-06-01",null,"2024-03-16"]
["3. Meldung (1. August)","1900-08-01",null,"2024-03-17"]
["4. Meldung (1. Oktober)","1900-10-01",null,"2024-03-18"]
[null,null,null,"2024-03-19"]
["Year",null,null,"2024-03-20"]
[2024,null,null,"2024-03-21"]
[null,null,null,"2024-03-22"]
[null,null,null,"2024-03-23"]
[null,null,null,"2024-03-24"]
[null,null,null,"2024-03-25"]
[null,null,null,"2024-03-26"]
[null,null,null,"2024-03-27"]
[null,null,null,"2024-03-28"]
{"$rows_left_out":228}
{"sheet":"Material1","index":5,"n_rows":2641,"n_cols":6,"rows_kept":2641,"cut":false,"hidden":true,"merged":[]}
["Material","MatType","UM","ValidFrom","ValidTo","Remark"]
[0,null,null,null,null,"Do not delete this line"]
["a",null,null,null,null,"Do not delete this line"]
["CFJ 060060 0010","Fenster","Stück","2005-12-01","2099-12-31"]
["CFJ 060060 1010","Fenster","Stück","2005-12-01","2099-12-31"]
["CFJ 060060 2020","Fenster","Stück","2005-12-01","2099-12-31"]
["CFJ 080080 0010","Fenster","Stück","2005-12-01","2099-12-31"]
["CFJ 080080 1010","Fenster","Stück","2005-12-01","2099-12-31"]
["CFJ 080080 2020","Fenster","Stück","2005-12-01","2099-12-31"]
["CFJ 090060 0010","Fenster","Stück","2005-12-01","2099-12-31"]
["CFJ 090060 1010","Fenster","Stück","2005-12-01","2099-12-31"]
["CFJ 090060 2020","Fenster","Stück","2005-12-01","2099-12-31"]
["CFJ 090090 0010","Fenster","Stück","2005-12-01","2099-12-31"]
["CFJ 090090 1010","Fenster","Stück","2005-12-01","2099-12-31"]
["CFJ 090090 2020","Fenster","Stück","2005-12-01","2099-12-31"]
{"$rows_left_out":2627}
{"sheet":"Material2","index":6,"n_rows":317,"n_cols":6,"rows_kept":317,"cut":false,"hidden":true,"merged":[]}
["Material","MatType","UM","ValidFrom","ValidTo","Remark"]
[0,null,null,null,null,"Do not delete this line"]
["a",null,null,null,null,"Do not delete this line"]
["SMG FK04 0000S","Rollläden","Stück","2005-12-01","2099-12-31"]
["SMG FK04 0700S","Rollläden","Stück","2005-12-01","2099-12-31"]
["SMG FK06 0000S","Rollläden","Stück","2005-12-01","2099-12-31"]
["SMG FK06 0700S","Rollläden","Stück","2005-12-01","2099-12-31"]
["SMG FK08 0000S","Rollläden","Stück","2005-12-01","2099-12-31"]
["SMG FK08 0700S","Rollläden","Stück","2005-12-01","2099-12-31"]
["SMG MK04 0000S","Rollläden","Stück","2005-12-01","2099-12-31"]
["SMG MK04 0700S","Rollläden","Stück","2005-12-01","2099-12-31"]
["SMG MK06 0000S","Rollläden","Stück","2005-12-01","2099-12-31"]
["SMG MK06 0700S","Rollläden","Stück","2005-12-01","2099-12-31"]
["SMG MK08 0000S","Rollläden","Stück","2005-12-01","2099-12-31"]
["SMG MK08 0700S","Rollläden","Stück","2005-12-01","2099-12-31"]
{"$rows_left_out":303}
{"sheet":"Contact","index":7,"n_rows":19,"n_cols":5,"rows_kept":19,"cut":false,"hidden":false,"merged":[]}
[]
[]
[]
[]
[null,null,{"$f":"VLOOKUP(122,TextID,CODE(Language!$B$4)-64,FALSE)","v":"VELUX Kontakt"}]
[]
[null,null,null,"VELUX Deutschland GmbH"]
[null,null,null,"Lagerbestand"]
[null,null,null,"Postfach 54 02 60"]
[null,null,null,"22502 Hamburg"]
[]
[null,null,null,"Kostenlose VELUX Service-Nummer Händler"]
[null,null,null,"0800 / 3 24 24 04*"]
[]
[null,null,null,"E-Mail:","lagerbestand@VELUX.de"]
{"$rows_left_out":5}
{"sheet":"Information","index":8,"n_rows":5,"n_cols":3,"rows_kept":5,"cut":false,"hidden":false,"merged":[]}
[]
[]
[]
[]
[null,null,{"$f":"VLOOKUP(131,TextID,CODE(Language!$B$4)-64,FALSE)&\" (gültig für 2024)\"","v":"Weitere Informationen (gültig für 2024)"}]

{"sheet":"Customer","index":9,"n_rows":33,"n_cols":5,"rows_kept":33,"cut":false,"hidden":false,"merged":[]}
[]
[]
[]
[]
[null,null,{"$f":"VLOOKUP(132,TextID,CODE(Language!$B$4)-64,FALSE)","v":"Kundenstammdaten"}]
[null,null,null,null,{"$f":"VLOOKUP(134,TextID,CODE(Language!$B$4)-64,FALSE)","v":"* Eingabe erforderlich"}]
[null,null,null,{"$f":"VLOOKUP(136,TextID,CODE(Language!$B$4)-64,FALSE)","v":"* Kundennummer"}]
[null,null,null,{"$f":"VLOOKUP(138,TextID,CODE(Language!$B$4)-64)","v":"* Firmenname"}]
[null,null,null,{"$f":"VLOOKUP(140,TextID,CODE(Language!$B$4)-64,FALSE)","v":"* Strasse"}]
[null,null,null,{"$f":"VLOOKUP(142,TextID,CODE(Language!$B$4)-64,FALSE)","v":"* Postleitzahl"}]
[null,null,null,{"$f":"VLOOKUP(144,TextID,CODE(Language!$B$4)-64,FALSE)","v":"* Ort"}]
[]
[null,null,null,{"$f":"VLOOKUP(146,TextID,CODE(Language!$B$4)-64,FALSE)","v":"* Name Bearbeiter"}]
[null,null,null,{"$f":"VLOOKUP(148,TextID,CODE(Language!$B$4)-64,FALSE)","v":"Telefon"}]
[null,null,null,{"$f":"VLOOKUP(150,TextID,CODE(Language!$B$4)-64,FALSE)","v":"E-mail"}]
{"$rows_left_out":19}
{"sheet":"Report1","index":10,"n_rows":162,"n_cols":12,"rows_kept":162,"cut":false,"hidden":false,"merged":[]}
[]
[]
[]
[]
[null,null,{"$f":"VLOOKUP(168,TextID,CODE(Language!$B$4)-64,FALSE)","v":"Meldeformular Fenster"},null,null,null,null,null,null,{"$f":"IF(OR(Customer!E7=\"\",Customer!E8=\"\"),VLOOKUP(304,TextID,CODE(Language!$B$4)-64,FALSE),CONCATENATE(Customer!E7,\" \",LEFT(Customer!E8,30)))","v":"Kundenname und/oder Nummer fehlt "}]
[null,null,null,null,null,{"$f":"VLOOKUP(326,TextID,CODE(Language!$B$4)-64,FALSE)","v":"* Zählung am:"}]
[null,null,null,null,null,{"$f":"VLOOKUP(226,TextID,CODE(Language!$B$4)-64,FALSE)","v":"* Meldung:"},null,null,null,{"$f":"VLOOKUP(170,TextID,CODE(Language!$B$4)-64,FALSE)","v":"* Eingabe erforderlich"}]
[null,null,null,null,null,{"$f":"VLOOKUP(228,TextID,CODE(Language!$B$4)-64,FALSE)","v":"* Jahr:"},null,null,2024]
[null,null,null,null,null,null,null,null,{"$f":"IF(OR(I7=\"\",I8=\"\"),\"\",DATE(I8,MONTH(VLOOKUP(I7,ReportPeriod1b,2,FALSE)),DAY(VLOOKUP(I7,ReportPeriod1b,2,FALSE))))","v":""},{"$f":"IF(I6<40000,\"\",I6)","v":""}]
[]
[null,null,null,null,null,{"$f":"VLOOKUP(172,TextID,CODE(Language!$B$4)-64,FALSE)","v":"Total:"},null,null,{"$f":"SUM(I14:I162)","v":0}]
[null,null,null,null,{"$f":"VLOOKUP(182,TextID,CODE(Language!$B$4)-64,FALSE)","v":"Artikkelnummer"},{"$f":"VLOOKUP(184,TextID,CODE(Language!$B$4)-64,FALSE)","v":"Gruppe"},"Einheit",null,{"$f":"VLOOKUP(186,TextID,CODE(Language!$B$4)-64,FALSE)","v":"Bestand"},{"$f":"VLOOKUP(192,TextID,CODE(Language!$B$4)-64,FALSE)","v":"Status"}]
[null,null,null,"CustNo","Material","MatType","UM","StockDate","StockQty","Status"]
[null,null,null,{"$f":"IF(E14=\"\",\"\",Customer!E$7)","v":""},null,{"$f":"IF($E14=\"\",\"\",VLOOKUP($E14,Material1b,2))","v":""},{"$f":"IF($E14=\"\",\"\",VLOOKUP($E14,Material1b,3))","v":""},{"$f":"IF(E14=\"\",\"\",I$9)","v":""},null,{"$f":"CONCATENATE(IF(AND(E14<>\"\",OR(I$9=\"\",J$9=\"\")),VLOOKUP(300,TextID,CODE(Language!$B$4)-64,FALSE),\"\"),IF(AND(E14<>\"\",I14=\"\"),VLOOKUP(302,TextID,CODE(Language!$B$4)-64,FALSE),\"\"),IF(AND(E14=\"\",I14<>\"\"),VLOOKUP(306,TextID,CODE(Language!$B$4)-64,FALSE),\"\"),IF(AND(E14<>\"\",E14=E13),VLOOKUP(308,TextID,CODE(Language!$B$4)-64,FALSE),\"\"),IF(AND(E14<>\"\",LEFT(E14,2)=\"GV\"),VLOOKUP(328,Language!A:F,6,FALSE),\"\"))","v":""},null,{"$f":"IF(E14=\"\",\"\",I$6)","v":""}]
[null,null,null,{"$f":"IF(E15=\"\",\"\",Customer!E$7)","v":""},null,"","","",null,{"$f":"CONCATENATE(IF(AND(E15<>\"\",OR(I$9=\"\",J$9=\"\")),VLOOKUP(300,TextID,CODE(Language!$B$4)-64,FALSE),\"\"),IF(AND(E15<>\"\",I15=\"\"),VLOOKUP(302,TextID,CODE(Language!$B$4)-64,FALSE),\"\"),IF(AND(E15=\"\",I15<>\"\"),VLOOKUP(306,TextID,CODE(Language!$B$4)-64,FALSE),\"\"),IF(AND(E15<>\"\",E15=E14),VLOOKUP(308,TextID,CODE(Language!$B$4)-64,FALSE),\"\"),IF(AND(E15<>\"\",LEFT(E15,2)=\"GV\"),VLOOKUP(328,Language!A:F,6,FALSE),\"\"))","v":""},null,""]
{"$rows_left_out":148}
{"sheet":"Report2","index":11,"n_rows":162,"n_cols":12,"rows_kept":162,"cut":false,"hidden":false,"merged":[]}
[]
[]
[]
[]
[null,null,{"$f":"VLOOKUP(218,TextID,CODE(Language!$B$4)-64,FALSE)","v":"Meldeformular Rollläden"},null,null,null,null,null,null,{"$f":"IF(OR(Customer!E7=\"\",Customer!E8=\"\"),VLOOKUP(304,TextID,CODE(Language!$B$4)-64,FALSE),CONCATENATE(Customer!E7,\" \",LEFT(Customer!E8,30)))","v":"Kundenname und/oder Nummer fehlt "}]
[null,null,null,null,null,{"$f":"VLOOKUP(326,TextID,CODE(Language!$B$4)-64,FALSE)","v":"* Zählung am:"},null,null,{"$f":"IF(Report1!I6=\"\",\"\",Report1!I6)","v":""}]
[null,null,null,null,null,{"$f":"VLOOKUP(226,TextID,CODE(Language!$B$4)-64,FALSE)","v":"* Meldung:"},null,null,{"$f":"IF(Report1!I7=\"\",\"\",Report1!I7)","v":""},{"$f":"VLOOKUP(170,TextID,CODE(Language!$B$4)-64,FALSE)","v":"* Eingabe erforderlich"}]
[null,null,null,null,null,{"$f":"VLOOKUP(228,TextID,CODE(Language!$B$4)-64,FALSE)","v":"* Jahr:"},null,null,{"$f":"IF(Report1!I8=\"\",\"\",Report1!I8)","v":2024}]
[]
[null,null,null,null,null,{"$f":"VLOOKUP(172,TextID,CODE(Language!$B$4)-64,FALSE)","v":"Total:"},null,null,{"$f":"SUM(I13:I162)","v":0}]
[null,null,null,null,"Artikelnummer *","Gruppe","Einheit",null,"* Bestand","Status"]
[null,null,null,"CustNo","Material","MatType","UM","StockDate","StockQty","Status"]
[null,null,null,{"$f":"IF(E13=\"\",\"\",Customer!E$7)","v":""},null,{"$f":"IF($E13=\"\",\"\",VLOOKUP($E13,Material2b,2))","v":""},{"$f":"IF($E13=\"\",\"\",VLOOKUP($E13,Material2b,3))","v":""},{"$f":"IF(E13=\"\",\"\",Report1!I$9)","v":""},null,{"$f":"CONCATENATE(IF(AND(E13<>\"\",OR(Report1!I$9=\"\",Report1!J$9=\"\")),VLOOKUP(300,TextID,CODE(Language!$B$4)-64,FALSE),\"\"),IF(AND(E13<>\"\",I13=\"\"),VLOOKUP(302,TextID,CODE(Language!$B$4)-64,FALSE),\"\"),IF(AND(E13=\"\",I13<>\"\"),VLOOKUP(306,TextID,CODE(Language!$B$4)-64,FALSE),\"\"),IF(AND(E13<>\"\",E13=E12),VLOOKUP(308,TextID,CODE(Language!$B$4)-64,FALSE),\"\"))","v":""},null,{"$f":"IF(E13=\"\",\"\",Report1!I$6)","v":""}]
[null,null,null,{"$f":"IF(E14=\"\",\"\",Customer!E$7)","v":""},null,"","",{"$f":"IF(E14=\"\",\"\",Report1!I$9)","v":""},null,{"$f":"CONCATENATE(IF(AND(E14<>\"\",OR(Report1!I$9=\"\",Report1!J$9=\"\")),VLOOKUP(300,TextID,CODE(Language!$B$4)-64,FALSE),\"\"),IF(AND(E14<>\"\",I14=\"\"),VLOOKUP(302,TextID,CODE(Language!$B$4)-64,FALSE),\"\"),IF(AND(E14=\"\",I14<>\"\"),VLOOKUP(306,TextID,CODE(Language!$B$4)-64,FALSE),\"\"),IF(AND(E14<>\"\",E14=E13),VLOOKUP(308,TextID,CODE(Language!$B$4)-64,FALSE),\"\"))","v":""},null,{"$f":"IF(E14=\"\",\"\",Report1!I$6)","v":""}]
[null,null,null,{"$f":"IF(E15=\"\",\"\",Customer!E$7)","v":""},null,"","",{"$f":"IF(E15=\"\",\"\",Report1!I$9)","v":""},null,{"$f":"CONCATENATE(IF(AND(E15<>\"\",OR(Report1!I$9=\"\",Report1!J$9=\"\")),VLOOKUP(300,TextID,CODE(Language!$B$4)-64,FALSE),\"\"),IF(AND(E15<>\"\",I15=\"\"),VLOOKUP(302,TextID,CODE(Language!$B$4)-64,FALSE),\"\"),IF(AND(E15=\"\",I15<>\"\"),VLOOKUP(306,TextID,CODE(Language!$B$4)-64,FALSE),\"\"),IF(AND(E15<>\"\",E15=E14),VLOOKUP(308,TextID,CODE(Language!$B$4)-64,FALSE),\"\"))","v":""},null,{"$f":"IF(E15=\"\",\"\",Report1!I$6)","v":""}]
{"$rows_left_out":147}