{"text_format":"1","workbook":"xlsx","n_sheets":12,"sheets":["CustomerData","Report1Data","Language","Help","Lookup","Material1","Material2","Contact","Information","Customer","Report1","Report2"],"not_rendered":{"charts":0,"images":15,"macros":1,"external_links":0,"defined_names":21,"comments":0,"pivot_tables":0},"unopened":[],"bounds":{"document_bytes":16777216,"sheet_cells":100000,"rows_first":2000,"rows_last":500,"rows_between":2000,"halvings":0,"cell_chars":16384,"cell_head_chars":4096},"cells_cut":0,"cells_raw":0,"read":"whole","date_system":"1900"}

{"sheet":"CustomerData","index":0,"n_rows":2,"n_cols":9,"rows_kept":2,"cut":false,"hidden":true,"merged":[]}
["CustNo","CustomerName","Address","PostalCode","City","PersonName","Telephone","Email","RptType"]
[{"$f":"IF(Customer!E7=\"\",0,Customer!E7)","v":0},{"$f":"IF(Customer!E8=\"\",\"#N/A\",Customer!E8)","v":"#N/A"},{"$f":"IF(Customer!E9=\"\",\"#N/A\",Customer!E9)","v":"#N/A"},{"$f":"IF(Customer!E10=\"\",\"#N/A\",Customer!E10)","v":"#N/A"},{"$f":"IF(Customer!E11=\"\",\"#N/A\",Customer!E11)","v":"#N/A"},{"$f":"IF(Customer!E13=\"\",\"#N/A\",Customer!E13)","v":"#N/A"},{"$f":"IF(Customer!E14=\"\",\"#N/A\",Customer!E14)","v":"#N/A"},{"$f":"IF(Customer!E15=\"\",\"#N/A\",Customer!E15)","v":"#N/A"},{"$f":"Customer!C33","v":"XLS02A"}]

{"sheet":"Report1Data","index":1,"n_rows":300,"n_cols":13,"rows_kept":300,"cut":false,"hidden":true,"merged":[]}
[{"$f":"IF(Report1!D13=\"\",\"#N/A\",Report1!D13)","v":"CustNo"},{"$f":"IF(Report1!E13=\"\",\"#N/A\",Report1!E13)","v":"Material"},{"$f":"IF(Report1!F13=\"\",\"#N/A\",Report1!F13)","v":"MatType"},{"$f":"IF(Report1!G13=\"\",\"#N/A\",Report1!G13)","v":"UM"},{"$f":"IF(Report1!H13=\"\",\"#N/A\",Report1!H13)","v":"StockDate"},{"$f":"IF(Report1!I13=\"\",\"#N/A\",Report1!I13)","v":"StockQty"},"SalesPeriodFrom","SalesPeriodTo","SalesQty","BudgetPeriodFrom","BudgetPeriodTo","BudgetQty",{"$f":"IF(Report1!J13=\"\",\"#N/A\",Report1!J13)","v":"Status"}]
[{"$f":"IF(Report1!D14=\"\",0,Report1!D14)","v":0},{"$f":"IF(Report1!E14=\"\",\"#N/A\",Report1!E14)","v":"#N/A"},{"$f":"IF(Report1!F14=\"\",\"#N/A\",Report1!F14)","v":"#N/A"},{"$f":"IF(Report1!G14=\"\",\"#N/A\",Report1!G14)","v":"#N/A"},{"$f":"IF(Report1!H14=\"\",DATE(1900,1,1),Report1!H14)","v":"1900-01-01"},{"$f":"IF(Report1!I14=\"\",0,Report1!I14)","v":0},{"$f":"DATE(1900,1,1)","v":"1900-01-01"},"1900-01-01",0,{"$f":"DATE(1900,1,1)","v":"1900-01-01"},"1900-01-01",0,{"$f":"IF(Report1!J14=\"\",\"#N/A\",Report1!J14)","v":"#N/A"}]
[{"$f":"IF(Report1!D15=\"\",0,Report1!D15)","v":0},{"$f":"IF(Report1!E15=\"\",\"#N/A\",Report1!E15)","v":"#N/A"},{"$f":"IF(Report1!F15=\"\",\"#N/A\",Report1!F15)","v":"#N/A"},{"$f":"IF(Report1!G15=\"\",\"#N/A\",Report1!G15)","v":"#N/A"},{"$f":"IF(Report1!H15=\"\",DATE(1900,1,1),Report1!H15)","v":"1900-01-01"},{"$f":"IF(Report1!I15=\"\",0,Report1!I15)","v":0},"1900-01-01","1900-01-01",0,"1900-01-01","1900-01-01",0,{"$f":"IF(Report1!J15=\"\",\"#N/A\",Report1!J15)","v":"#N/A"}]
[{"$f":"IF(Report1!D16=\"\",0,Report1!D16)","v":0},{"$f":"IF(Report1!E16=\"\",\"#N/A\",Report1!E16)","v":"#N/A"},{"$f":"IF(Report1!F16=\"\",\"#N/A\",Report1!F16)","v":"#N/A"},{"$f":"IF(Report1!G16=\"\",\"#N/A\",Report1!G16)","v":"#N/A"},{"$f":"IF(Report1!H16=\"\",DATE(1900,1,1),Report1!H16)","v":"1900-01-01"},{"$f":"IF(Report1!I16=\"\",0,Report1!I16)","v":0},"1900-01-01","1900-01-01",0,"1900-01-01","1900-01-01",0,{"$f":"IF(Report1!J16=\"\",\"#N/A\",Report1!J16)","v":"#N/A"}]
[{"$f":"IF(Report1!D17=\"\",0,Report1!D17)","v":0},{"$f":"IF(Report1!E17=\"\",\"#N/A\",Report1!E17)","v":"#N/A"},{"$f":"IF(Report1!F17=\"\",\"#N/A\",Report1!F17)","v":"#N/A"},{"$f":"IF(Report1!G17=\"\",\"#N/A\",Report1!G17)","v":"#N/A"},{"$f":"IF(Report1!H17=\"\",DATE(1900,1,1),Report1!H17)","v":"1900-01-01"},{"$f":"IF(Report1!I17=\"\",0,Report1!I17)","v":0},"1900-01-01","1900-01-01",0,"1900-01-01","1900-01-01",0,{"$f":"IF(Report1!J17=\"\",\"#N/A\",Report1!J17)","v":"#N/A"}]
[{"$f":"IF(Report1!D18=\"\",0,Report1!D18)","v":0},{"$f":"IF(Report1!E18=\"\",\"#N/A\",Report1!E18)","v":"#N/A"},{"$f":"IF(Report1!F18=\"\",\"#N/A\",Report1!F18)","v":"#N/A"},{"$f":"IF(Report1!G18=\"\",\"#N/A\",Report1!G18)","v":"#N/A"},{"$f":"IF(Report1!H18=\"\",DATE(1900,1,1),Report1!H18)","v":"1900-01-01"},{"$f":"IF(Report1!I18=\"\",0,Report1!I18)","v":0},"1900-01-01","1900-01-01",0,"1900-01-01","1900-01-01",0,{"$f":"IF(Report1!J18=\"\",\"#N/A\",Report1!J18)","v":"#N/A"}]
[{"$f":"IF(Report1!D19=\"\",0,Report1!D19)","v":0},{"$f":"IF(Report1!E19=\"\",\"#N/A\",Report1!E19)","v":"#N/A"},{"$f":"IF(Report1!F19=\"\",\"#N/A\",Report1!F19)","v":"#N/A"},{"$f":"IF(Report1!G19=\"\",\"#N/A\",Report1!G19)","v":"#N/A"},{"$f":"IF(Report1!H19=\"\",DATE(1900,1,1),Report1!H19)","v":"1900-01-01"},{"$f":"IF(Report1!I19=\"\",0,Report1!I19)","v":0},"1900-01-01","1900-01-01",0,"1900-01-01","1900-01-01",0,{"$f":"IF(Report1!J19=\"\",\"#N/A\",Report1!J19)","v":"#N/A"}]
[{"$f":"IF(Report1!D20=\"\",0,Report1!D20)","v":0},{"$f":"IF(Report1!E20=\"\",\"#N/A\",Report1!E20)","v":"#N/A"},{"$f":"IF(Report1!F20=\"\",\"#N/A\",Report1!F20)","v":"#N/A"},{"$f":"IF(Report1!G20=\"\",\"#N/A\",Report1!G20)","v":"#N/A"},{"$f":"IF(Report1!H20=\"\",DATE(1900,1,1),Report1!H20)","v":"1900-01-01"},{"$f":"IF(Report1!I20=\"\",0,Report1!I20)","v":0},"1900-01-01","1900-01-01",0,"1900-01-01","1900-01-01",0,{"$f":"IF(Report1!J20=\"\",\"#N/A\",Report1!J20)","v":"#N/A"}]
[{"$f":"IF(Report1!D21=\"\",0,Report1!D21)","v":0},{"$f":"IF(Report1!E21=\"\",\"#N/A\",Report1!E21)","v":"#N/A"},{"$f":"IF(Report1!F21=\"\",\"#N/A\",Report1!F21)","v":"#N/A"},{"$f":"IF(Report1!G21=\"\",\"#N/A\",Report1!G21)","v":"#N/A"},{"$f":"IF(Report1!H21=\"\",DATE(1900,1,1),Report1!H21)","v":"1900-01-01"},{"$f":"IF(Report1!I21=\"\",0,Report1!I21)","v":0},"1900-01-01","1900-01-01",0,"1900-01-01","1900-01-01",0,{"$f":"IF(Report1!J21=\"\",\"#N/A\",Report1!J21)","v":"#N/A"}]
[{"$f":"IF(Report1!D22=\"\",0,Report1!D22)","v":0},{"$f":"IF(Report1!E22=\"\",\"#N/A\",Report1!E22)","v":"#N/A"},{"$f":"IF(Report1!F22=\"\",\"#N/A\",Report1!F22)","v":"#N/A"},{"$f":"IF(Report1!G22=\"\",\"#N/A\",Report1!G22)","v":"#N/A"},{"$f":"IF(Report1!H22=\"\",DATE(1900,1,1),Report1!H22)","v":"1900-01-01"},{"$f":"IF(Report1!I22=\"\",0,Report1!I22)","v":0},"1900-01-01","1900-01-01",0,"1900-01-01","1900-01-01",0,{"$f":"IF(Report1!J22=\"\",\"#N/A\",Report1!J22)","v":"#N/A"}]
[{"$f":"IF(Report1!D23=\"\",0,Report1!D23)","v":0},{"$f":"IF(Report1!E23=\"\",\"#N/A\",Report1!E23)","v":"#N/A"},{"$f":"IF(Report1!F23=\"\",\"#N/A\",Report1!F23)","v":"#N/A"},{"$f":"IF(Report1!G23=\"\",\"#N/A\",Report1!G23)","v":"#N/A"},{"$f":"IF(Report1!H23=\"\",DATE(1900,1,1),Report1!H23)","v":"1900-01-01"},{"$f":"IF(Report1!I23=\"\",0,Report1!I23)","v":0},"1900-01-01","1900-01-01",0,"1900-01-01","1900-01-01",0,{"$f":"IF(Report1!J23=\"\",\"#N/A\",Report1!J23)","v":"#N/A"}]
[{"$f":"IF(Report1!D24=\"\",0,Report1!D24)","v":0},{"$f":"IF(Report1!E24=\"\",\"#N/A\",Report1!E24)","v":"#N/A"},{"$f":"IF(Report1!F24=\"\",\"#N/A\",Report1!F24)","v":"#N/A"},{"$f":"IF(Report1!G24=\"\",\"#N/A\",Report1!G24)","v":"#N/A"},{"$f":"IF(Report1!H24=\"\",DATE(1900,1,1),Report1!H24)","v":"1900-01-01"},{"$f":"IF(Report1!I24=\"\",0,Report1!I24)","v":0},"1900-01-01","1900-01-01",0,"1900-01-01","1900-01-01",0,{"$f":"IF(Report1!J24=\"\",\"#N/A\",Report1!J24)","v":"#N/A"}]
[{"$f":"IF(Report1!D25=\"\",0,Report1!D25)","v":0},{"$f":"IF(Report1!E25=\"\",\"#N/A\",Report1!E25)","v":"#N/A"},{"$f":"IF(Report1!F25=\"\",\"#N/A\",Report1!F25)","v":"#N/A"},{"$f":"IF(Report1!G25=\"\",\"#N/A\",Report1!G25)","v":"#N/A"},{"$f":"IF(Report1!H25=\"\",DATE(1900,1,1),Report1!H25)","v":"1900-01-01"},{"$f":"IF(Report1!I25=\"\",0,Report1!I25)","v":0},"1900-01-01","1900-01-01",0,"1900-01-01","1900-01-01",0,{"$f":"IF(Report1!J25=\"\",\"#N/A\",Report1!J25)","v":"#N/A"}]
[{"$f":"IF(Report1!D26=\"\",0,Report1!D26)","v":0},{"$f":"IF(Report1!E26=\"\",\"#N/A\",Report1!E26)","v":"#N/A"},{"$f":"IF(Report1!F26=\"\",\"#N/A\",Report1!F26)","v":"#N/A"},{"$f":"IF(Report1!G26=\"\",\"#N/A\",Report1!G26)","v":"#N/A"},{"$f":"IF(Report1!H26=\"\",DATE(1900,1,1),Report1!H26)","v":"1900-01-01"},{"$f":"IF(Report1!I26=\"\",0,Report1!I26)","v":0},"1900-01-01","1900-01-01",0,"1900-01-01","1900-01-01",0,{"$f":"IF(Report1!J26=\"\",\"#N/A\",Report1!J26)","v":"#N/A"}]
[{"$f":"IF(Report1!D27=\"\",0,Report1!D27)","v":0},{"$f":"IF(Report1!E27=\"\",\"#N/A\",Report1!E27)","v":"#N/A"},{"$f":"IF(Report1!F27=\"\",\"#N/A\",Report1!F27)","v":"#N/A"},{"$f":"IF(Report1!G27=\"\",\"#N/A\",Report1!G27)","v":"#N/A"},{"$f":"IF(Report1!H27=\"\",DATE(1900,1,1),Report1!H27)","v":"1900-01-01"},{"$f":"IF(Report1!I27=\"\",0,Report1!I27)","v":0},"1900-01-01","1900-01-01",0,"1900-01-01","1900-01-01",0,{"$f":"IF(Report1!J27=\"\",\"#N/A\",Report1!J27)","v":"#N/A"}]
[{"$f":"IF(Report1!D28=\"\",0,Report1!D28)","v":0},{"$f":"IF(Report1!E28=\"\",\"#N/A\",Report1!E28)","v":"#N/A"},{"$f":"IF(Report1!F28=\"\",\"#N/A\",Report1!F28)","v":"#N/A"},{"$f":"IF(Report1!G28=\"\",\"#N/A\",Report1!G28)","v":"#N/A"},{"$f":"IF(Report1!H28=\"\",DATE(1900,1,1),Report1!H28)","v":"1900-01-01"},{"$f":"IF(Report1!I28=\"\",0,Report1!I28)","v":0},"1900-01-01","1900-01-01",0,"1900-01-01","1900-01-01",0,{"$f":"IF(Report1!J28=\"\",\"#N/A\",Report1!J28)","v":"#N/A"}]
[{"$f":"IF(Report1!D29=\"\",0,Report1!D29)","v":0},{"$f":"IF(Report1!E29=\"\",\"#N/A\",Report1!E29)","v":"#N/A"},{"$f":"IF(Report1!F29=\"\",\"#N/A\",Report1!F29)","v":"#N/A"},{"$f":"IF(Report1!G29=\"\",\"#N/A\",Report1!G29)","v":"#N/A"},{"$f":"IF(Report1!H29=\"\",DATE(1900,1,1),Report1!H29)","v":"1900-01-01"},{"$f":"IF(Report1!I29=\"\",0,Report1!I29)","v":0},"1900-01-01","1900-01-01",0,"1900-01-01","1900-01-01",0,{"$f":"IF(Report1!J29=\"\",\"#N/A\",Report1!J29)","v":"#N/A"}]
[{"$f":"IF(Report1!D30=\"\",0,Report1!D30)","v":0},{"$f":"IF(Report1!E30=\"\",\"#N/A\",Report1!E30)","v":"#N/A"},{"$f":"IF(Report1!F30=\"\",\"#N/A\",Report1!F30)","v":"#N/A"},{"$f":"IF(Report1!G30=\"\",\"#N/A\",Report1!G30)","v":"#N/A"},{"$f":"IF(Report1!H30=\"\",DATE(1900,1,1),Report1!H30)","v":"1900-01-01"},{"$f":"IF(Report1!I30=\"\",0,Report1!I30)","v":0},"1900-01-01","1900-01-01",0,"1900-01-01","1900-01-01",0,{"$f":"IF(Report1!J30=\"\",\"#N/A\",Report1!J30)","v":"#N/A"}]
[{"$f":"IF(Report1!D31=\"\",0,Report1!D31)","v":0},{"$f":"IF(Report1!E31=\"\",\"#N/A\",Report1!E31)","v":"#N/A"},{"$f":"IF(Report1!F31=\"\",\"#N/A\",Report1!F31)","v":"#N/A"},{"$f":"IF(Report1!G31=\"\",\"#N/A\",Report1!G31)","v":"#N/A"},{"$f":"IF(Report1!H31=\"\",DATE(1900,1,1),Report1!H31)","v":"1900-01-01"},{"$f":"IF(Report1!I31=\"\",0,Report1!I31)","v":0},"1900-01-01","1900-01-01",0,"1900-01-01","1900-01-01",0,{"$f":"IF(Report1!J31=\"\",\"#N/A\",Report1!J31)","v":"#N/A"}]
[{"$f":"IF(Report1!D32=\"\",0,Report1!D32)","v":0},{"$f":"IF(Report1!E32=\"\",\"#N/A\",Report1!E32)","v":"#N/A"},{"$f":"IF(Report1!F32=\"\",\"#N/A\",Report1!F32)","v":"#N/A"},{"$f":"IF(Report1!G32=\"\",\"#N/A\",Report1!G32)","v":"#N/A"},{"$f":"IF(Report1!H32=\"\",DATE(1900,1,1),Report1!H32)","v":"1900-01-01"},{"$f":"IF(Report1!I32=\"\",0,Report1!I32)","v":0},"1900-01-01","1900-01-01",0,"1900-01-01","1900-01-01",0,{"$f":"IF(Report1!J32=\"\",\"#N/A\",Report1!J32)","v":"#N/A"}]
[{"$f":"IF(Report1!D33=\"\",0,Report1!D33)","v":0},{"$f":"IF(Report1!E33=\"\",\"#N/A\",Report1!E33)","v":"#N/A"},{"$f":"IF(Report1!F33=\"\",\"#N/A\",Report1!F33)","v":"#N/A"},{"$f":"IF(Report1!G33=\"\",\"#N/A\",Report1!G33)","v":"#N/A"},{"$f":"IF(Report1!H33=\"\",DATE(1900,1,1),Report1!H33)","v":"1900-01-01"},{"$f":"IF(Report1!I33=\"\",0,Report1!I33)","v":0},"1900-01-01","1900-01-01",0,"1900-01-01","1900-01-01",0,{"$f":"IF(Report1!J33=\"\",\"#N/A\",Report1!J33)","v":"#N/A"}]
[{"$f":"IF(Report1!D34=\"\",0,Report1!D34)","v":0},{"$f":"IF(Report1!E34=\"\",\"#N/A\",Report1!E34)","v":"#N/A"},{"$f":"IF(Report1!F34=\"\",\"#N/A\",Report1!F34)","v":"#N/A"},{"$f":"IF(Report1!G34=\"\",\"#N/A\",Report1!G34)","v":"#N/A"},{"$f":"IF(Report1!H34=\"\",DATE(1900,1,1),Report1!H34)","v":"1900-01-01"},{"$f":"IF(Report1!I34=\"\",0,Report1!I34)","v":0},"1900-01-01","1900-01-01",0,"1900-01-01","1900-01-01",0,{"$f":"IF(Report1!J34=\"\",\"#N/A\",Report1!J34)","v":"#N/A"}]
[{"$f":"IF(Report1!D35=\"\",0,Report1!D35)","v":0},{"$f":"IF(Report1!E35=\"\",\"#N/A\",Report1!E35)","v":"#N/A"},{"$f":"IF(Report1!F35=\"\",\"#N/A\",Report1!F35)","v":"#N/A"},{"$f":"IF(Report1!G35=\"\",\"#N/A\",Report1!G35)","v":"#N/A"},{"$f":"IF(Report1!H35=\"\",DATE(1900,1,1),Report1!H35)","v":"1900-01-01"},{"$f":"IF(Report1!I35=\"\",0,Report1!I35)","v":0},"1900-01-01","1900-01-01",0,"1900-01-01","1900-01-01",0,{"$f":"IF(Report1!J35=\"\",\"#N/A\",Report1!J35)","v":"#N/A"}]
[{"$f":"IF(Report1!D36=\"\",0,Report1!D36)","v":0},{"$f":"IF(Report1!E36=\"\",\"#N/A\",Report1!E36)","v":"#N/A"},{"$f":"IF(Report1!F36=\"\",\"#N/A\",Report1!F36)","v":"#N/A"},{"$f":"IF(Report1!G36=\"\",\"#N/A\",Report1!G36)","v":"#N/A"},{"$f":"IF(Report1!H36=\"\",DATE(1900,1,1),Report1!H36)","v":"1900-01-01"},{"$f":"IF(Report1!I36=\"\",0,Report1!I36)","v":0},"1900-01-01","1900-01-01",0,"1900-01-01","1900-01-01",0,{"$f":"IF(Report1!J36=\"\",\"#N/A\",Report1!J36)","v":"#N/A"}]
[{"$f":"IF(Report1!D37=\"\",0,Report1!D37)","v":0},{"$f":"IF(Report1!E37=\"\",\"#N/A\",Report1!E37)","v":"#N/A"},{"$f":"IF(Report1!F37=\"\",\"#N/A\",Report1!F37)","v":"#N/A"},{"$f":"IF(Report1!G37=\"\",\"#N/A\",Report1!G37)","v":"#N/A"},{"$f":"IF(Report1!H37=\"\",DATE(1900,1,1),Report1!H37)","v":"1900-01-01"},{"$f":"IF(Report1!I37=\"\",0,Report1!I37)","v":0},"1900-01-01","1900-01-01",0,"1900-01-01","1900-01-01",0,{"$f":"IF(Report1!J37=\"\",\"#N/A\",Report1!J37)","v":"#N/A"}]
[{"$f":"IF(Report1!D38=\"\",0,Report1!D38)","v":0},{"$f":"IF(Report1!E38=\"\",\"#N/A\",Report1!E38)","v":"#N/A"},{"$f":"IF(Report1!F38=\"\",\"#N/A\",Report1!F38)","v":"#N/A"},{"$f":"IF(Report1!G38=\"\",\"#N/A\",Report1!G38)","v":"#N/A"},{"$f":"IF(Report1!H38=\"\",DATE(1900,1,1),Report1!H38)","v":"1900-01-01"},{"$f":"IF(Report1!I38=\"\",0,Report1!I38)","v":0},"1900-01-01","1900-01-01",0,"1900-01-01","1900-01-01",0,{"$f":"IF(Report1!J38=\"\",\"#N/A\",Report1!J38)","v":"#N/A"}]
[{"$f":"IF(Report1!D39=\"\",0,Report1!D39)","v":0},{"$f":"IF(Report1!E39=\"\",\"#N/A\",Report1!E39)","v":"#N/A"},{"$f":"IF(Report1!F39=\"\",\"#N/A\",Report1!F39)","v":"#N/A"},{"$f":"IF(Report1!G39=\"\",\"#N/A\",Report1!G39)","v":"#N/A"},{"$f":"IF(Report1!H39=\"\",DATE(1900,1,1),Report1!H39)","v":"1900-01-01"},{"$f":"IF(Report1!I39=\"\",0,Report1!I39)","v":0},"1900-01-01","1900-01-01",0,"1900-01-01","1900-01-01",0,{"$f":"IF(Report1!J39=\"\",\"#N/A\",Report1!J39)","v":"#N/A"}]
[{"$f":"IF(Report1!D40=\"\",0,Report1!D40)","v":0},{"$f":"IF(Report1!E40=\"\",\"#N/A\",Report1!E40)","v":"#N/A"},{"$f":"IF(Report1!F40=\"\",\"#N/A\",Report1!F40)","v":"#N/A"},{"$f":"IF(Report1!G40=\"\",\"#N/A\",Report1!G40)","v":"#N/A"},{"$f":"IF(Report1!H40=\"\",DATE(1900,1,1),Report1!H40)","v":"1900-01-01"},{"$f":"IF(Report1!I40=\"\",0,Report1!I40)","v":0},"1900-01-01","1900-01-01",0,"1900-01-01","1900-01-01",0,{"$f":"IF(Report1!J40=\"\",\"#N/A\",Report1!J40)","v":"#N/A"}]
[{"$f":"IF(Report1!D41=\"\",0,Report1!D41)","v":0},{"$f":"IF(Report1!E41=\"\",\"#N/A\",Report1!E41)","v":"#N/A"},{"$f":"IF(Report1!F41=\"\",\"#N/A\",Report1!F41)","v":"#N/A"},{"$f":"IF(Report1!G41=\"\",\"#N/A\",Report1!G41)","v":"#N/A"},{"$f":"IF(Report1!H41=\"\",DATE(1900,1,1),Report1!H41)","v":"1900-01-01"},{"$f":"IF(Report1!I41=\"\",0,Report1!I41)","v":0},"1900-01-01","1900-01-01",0,"1900-01-01","1900-01-01",0,{"$f":"IF(Report1!J41=\"\",\"#N/A\",Report1!J41)","v":"#N/A"}]
[{"$f":"IF(Report1!D42=\"\",0,Report1!D42)","v":0},{"$f":"IF(Report1!E42=\"\",\"#N/A\",Report1!E42)","v":"#N/A"},{"$f":"IF(Report1!F42=\"\",\"#N/A\",Report1!F42)","v":"#N/A"},{"$f":"IF(Report1!G42=\"\",\"#N/A\",Report1!G42)","v":"#N/A"},{"$f":"IF(Report1!H42=\"\",DATE(1900,1,1),Report1!H42)","v":"1900-01-01"},{"$f":"IF(Report1!I42=\"\",0,Report1!I42)","v":0},"1900-01-01","1900-01-01",0,"1900-01-01","1900-01-01",0,{"$f":"IF(Report1!J42=\"\",\"#N/A\",Report1!J42)","v":"#N/A"}]
[{"$f":"IF(Report1!D43=\"\",0,Report1!D43)","v":0},{"$f":"IF(Report1!E43=\"\",\"#N/A\",Report1!E43)","v":"#N/A"},{"$f":"IF(Report1!F43=\"\",\"#N/A\",Report1!F43)","v":"#N/A"},{"$f":"IF(Report1!G43=\"\",\"#N/A\",Report1!G43)","v":"#N/A"},{"$f":"IF(Report1!H43=\"\",DATE(1900,1,1),Report1!H43)","v":"1900-01-01"},{"$f":"IF(Report1!I43=\"\",0,Report1!I43)","v":0},"1900-01-01","1900-01-01",0,"1900-01-01","1900-01-01",0,{"$f":"IF(Report1!J43=\"\",\"#N/A\",Report1!J43)","v":"#N/A"}]
[{"$f":"IF(Report1!D44=\"\",0,Report1!D44)","v":0},{"$f":"IF(Report1!E44=\"\",\"#N/A\",Report1!E44)","v":"#N/A"},{"$f":"IF(Report1!F44=\"\",\"#N/A\",Report1!F44)","v":"#N/A"},{"$f":"IF(Report1!G44=\"\",\"#N/A\",Report1!G44)","v":"#N/A"},{"$f":"IF(Report1!H44=\"\",DATE(1900,1,1),Report1!H44)","v":"1900-01-01"},{"$f":"IF(Report1!I44=\"\",0,Report1!I44)","v":0},"1900-01-01","1900-01-01",0,"1900-01-01","1900-01-01",0,{"$f":"IF(Report1!J44=\"\",\"#N/A\",Report1!J44)","v":"#N/A"}]
[{"$f":"IF(Report1!D45=\"\",0,Report1!D45)","v":0},{"$f":"IF(Report1!E45=\"\",\"#N/A\",Report1!E45)","v":"#N/A"},{"$f":"IF(Report1!F45=\"\",\"#N/A\",Report1!F45)","v":"#N/A"},{"$f":"IF(Report1!G45=\"\",\"#N/A\",Report1!G45)","v":"#N/A"},{"$f":"IF(Report1!H45=\"\",DATE(1900,1,1),Report1!H45)","v":"1900-01-01"},{"$f":"IF(Report1!I45=\"\",0,Report1!I45)","v":0},"1900-01-01","1900-01-01",0,"1900-01-01","1900-01-01",0,{"$f":"IF(Report1!J45=\"\",\"#N/A\",Report1!J45)","v":"#N/A"}]
[{"$f":"IF(Report1!D46=\"\",0,Report1!D46)","v":0},{"$f":"IF(Report1!E46=\"\",\"#N/A\",Report1!E46)","v":"#N/A"},{"$f":"IF(Report1!F46=\"\",\"#N/A\",Report1!F46)","v":"#N/A"},{"$f":"IF(Report1!G46=\"\",\"#N/A\",Report1!G46)","v":"#N/A"},{"$f":"IF(Report1!H46=\"\",DATE(1900,1,1),Report1!H46)","v":"1900-01-01"},{"$f":"IF(Report1!I46=\"\",0,Report1!I46)","v":0},"1900-01-01","1900-01-01",0,"1900-01-01","1900-01-01",0,{"$f":"IF(Report1!J46=\"\",\"#N/A\",Report1!J46)","v":"#N/A"}]
[{"$f":"IF(Report1!D47=\"\",0,Report1!D47)","v":0},{"$f":"IF(Report1!E47=\"\",\"#N/A\",Report1!E47)","v":"#N/A"},{"$f":"IF(Report1!F47=\"\",\"#N/A\",Report1!F47)","v":"#N/A"},{"$f":"IF(Report1!G47=\"\",\"#N/A\",Report1!G47)","v":"#N/A"},{"$f":"IF(Report1!H47=\"\",DATE(1900,1,1),Report1!H47)","v":"1900-01-01"},{"$f":"IF(Report1!I47=\"\",0,Report1!I47)","v":0},"1900-01-01","1900-01-01",0,"1900-01-01","1900-01-01",0,{"$f":"IF(Report1!J47=\"\",\"#N/A\",Report1!J47)","v":"#N/A"}]
[{"$f":"IF(Report1!D48=\"\",0,Report1!D48)","v":0},{"$f":"IF(Report1!E48=\"\",\"#N/A\",Report1!E48)","v":"#N/A"},{"$f":"IF(Report1!F48=\"\",\"#N/A\",Report1!F48)","v":"#N/A"},{"$f":"IF(Report1!G48=\"\",\"#N/A\",Report1!G48)","v":"#N/A"},{"$f":"IF(Report1!H48=\"\",DATE(1900,1,1),Report1!H48)","v":"1900-01-01"},{"$f":"IF(Report1!I48=\"\",0,Report1!I48)","v":0},"1900-01-01","1900-01-01",0,"1900-01-01","1900-01-01",0,{"$f":"IF(Report1!J48=\"\",\"#N/A\",Report1!J48)","v":"#N/A"}]
[{"$f":"IF(Report1!D49=\"\",0,Report1!D49)","v":0},{"$f":"IF(Report1!E49=\"\",\"#N/A\",Report1!E49)","v":"#N/A"},{"$f":"IF(Report1!F49=\"\",\"#N/A\",Report1!F49)","v":"#N/A"},{"$f":"IF(Report1!G49=\"\",\"#N/A\",Report1!G49)","v":"#N/A"},{"$f":"IF(Report1!H49=\"\",DATE(1900,1,1),Report1!H49)","v":"1900-01-01"},{"$f":"IF(Report1!I49=\"\",0,Report1!I49)","v":0},"1900-01-01","1900-01-01",0,"1900-01-01","1900-01-01",0,{"$f":"IF(Report1!J49=\"\",\"#N/A\",Report1!J49)","v":"#N/A"}]
[{"$f":"IF(Report1!D50=\"\",0,Report1!D50)","v":0},{"$f":"IF(Report1!E50=\"\",\"#N/A\",Report1!E50)","v":"#N/A"},{"$f":"IF(Report1!F50=\"\",\"#N/A\",Report1!F50)","v":"#N/A"},{"$f":"IF(Report1!G50=\"\",\"#N/A\",Report1!G50)","v":"#N/A"},{"$f":"IF(Report1!H50=\"\",DATE(1900,1,1),Report1!H50)","v":"1900-01-01"},{"$f":"IF(Report1!I50=\"\",0,Report1!I50)","v":0},"1900-01-01","1900-01-01",0,"1900-01-01","1900-01-01",0,{"$f":"IF(Report1!J50=\"\",\"#N/A\",Report1!J50)","v":"#N/A"}]
[{"$f":"IF(Report1!D51=\"\",0,Report1!D51)","v":0},{"$f":"IF(Report1!E51=\"\",\"#N/A\",Report1!E51)","v":"#N/A"},{"$f":"IF(Report1!F51=\"\",\"#N/A\",Report1!F51)","v":"#N/A"},{"$f":"IF(Report1!G51=\"\",\"#N/A\",Report1!G51)","v":"#N/A"},{"$f":"IF(Report1!H51=\"\",DATE(1900,1,1),Report1!H51)","v":"1900-01-01"},{"$f":"IF(Report1!I51=\"\",0,Report1!I51)","v":0},"1900-01-01","1900-01-01",0,"1900-01-01","1900-01-01",0,{"$f":"IF(Report1!J51=\"\",\"#N/A\",Report1!J51)","v":"#N/A"}]
[{"$f":"IF(Report1!D52=\"\",0,Report1!D52)","v":0},{"$f":"IF(Report1!E52=\"\",\"#N/A\",Report1!E52)","v":"#N/A"},{"$f":"IF(Report1!F52=\"\",\"#N/A\",Report1!F52)","v":"#N/A"},{"$f":"IF(Report1!G52=\"\",\"#N/A\",Report1!G52)","v":"#N/A"},{"$f":"IF(Report1!H52=\"\",DATE(1900,1,1),Report1!H52)","v":"1900-01-01"},{"$f":"IF(Report1!I52=\"\",0,Report1!I52)","v":0},"1900-01-01","1900-01-01",0,"1900-01-01","1900-01-01",0,{"$f":"IF(Report1!J52=\"\",\"#N/A\",Report1!J52)","v":"#N/A"}]
[{"$f":"IF(Report1!D53=\"\",0,Report1!D53)","v":0},{"$f":"IF(Report1!E53=\"\",\"#N/A\",Report1!E53)","v":"#N/A"},{"$f":"IF(Report1!F53=\"\",\"#N/A\",Report1!F53)","v":"#N/A"},{"$f":"IF(Report1!G53=\"\",\"#N/A\",Report1!G53)","v":"#N/A"},{"$f":"IF(Report1!H53=\"\",DATE(1900,1,1),Report1!H53)","v":"1900-01-01"},{"$f":"IF(Report1!I53=\"\",0,Report1!I53)","v":0},"1900-01-01","1900-01-01",0,"1900-01-01","1900-01-01",0,{"$f":"IF(Report1!J53=\"\",\"#N/A\",Report1!J53)","v":"#N/A"}]
[{"$f":"IF(Report1!D54=\"\",0,Report1!D54)","v":0},{"$f":"IF(Report1!E54=\"\",\"#N/A\",Report1!E54)","v":"#N/A"},{"$f":"IF(Report1!F54=\"\",\"#N/A\",Report1!F54)","v":"#N/A"},{"$f":"IF(Report1!G54=\"\",\"#N/A\",Report1!G54)","v":"#N/A"},{"$f":"IF(Report1!H54=\"\",DATE(1900,1,1),Report1!H54)","v":"1900-01-01"},{"$f":"IF(Report1!I54=\"\",0,Report1!I54)","v":0},"1900-01-01","1900-01-01",0,"1900-01-01","1900-01-01",0,{"$f":"IF(Report1!J54=\"\",\"#N/A\",Report1!J54)","v":"#N/A"}]
[{"$f":"IF(Report1!D55=\"\",0,Report1!D55)","v":0},{"$f":"IF(Report1!E55=\"\",\"#N/A\",Report1!E55)","v":"#N/A"},{"$f":"IF(Report1!F55=\"\",\"#N/A\",Report1!F55)","v":"#N/A"},{"$f":"IF(Report1!G55=\"\",\"#N/A\",Report1!G55)","v":"#N/A"},{"$f":"IF(Report1!H55=\"\",DATE(1900,1,1),Report1!H55)","v":"1900-01-01"},{"$f":"IF(Report1!I55=\"\",0,Report1!I55)","v":0},"1900-01-01","1900-01-01",0,"1900-01-01","1900-01-01",0,{"$f":"IF(Report1!J55=\"\",\"#N/A\",Report1!J55)","v":"#N/A"}]
[{"$f":"IF(Report1!D56=\"\",0,Report1!D56)","v":0},{"$f":"IF(Report1!E56=\"\",\"#N/A\",Report1!E56)","v":"#N/A"},{"$f":"IF(Report1!F56=\"\",\"#N/A\",Report1!F56)","v":"#N/A"},{"$f":"IF(Report1!G56=\"\",\"#N/A\",Report1!G56)","v":"#N/A"},{"$f":"IF(Report1!H56=\"\",DATE(1900,1,1),Report1!H56)","v":"1900-01-01"},{"$f":"IF(Report1!I56=\"\",0,Report1!I56)","v":0},"1900-01-01","1900-01-01",0,"1900-01-01","1900-01-01",0,{"$f":"IF(Report1!J56=\"\",\"#N/A\",Report1!J56)","v":"#N/A"}]
[{"$f":"IF(Report1!D57=\"\",0,Report1!D57)","v":0},{"$f":"IF(Report1!E57=\"\",\"#N/A\",Report1!E57)","v":"#N/A"},{"$f":"IF(Report1!F57=\"\",\"#N/A\",Report1!F57)","v":"#N/A"},{"$f":"IF(Report1!G57=\"\",\"#N/A\",Report1!G57)","v":"#N/A"},{"$f":"IF(Report1!H57=\"\",DATE(1900,1,1),Report1!H57)","v":"1900-01-01"},{"$f":"IF(Report1!I57=\"\",0,Report1!I57)","v":0},"1900-01-01","1900-01-01",0,"1900-01-01","1900-01-01",0,{"$f":"IF(Report1!J57=\"\",\"#N/A\",Report1!J57)","v":"#N/A"}]
[{"$f":"IF(Report1!D58=\"\",0,Report1!D58)","v":0},{"$f":"IF(Report1!E58=\"\",\"#N/A\",Report1!E58)","v":"#N/A"},{"$f":"IF(Report1!F58=\"\",\"#N/A\",Report1!F58)","v":"#N/A"},{"$f":"IF(Report1!G58=\"\",\"#N/A\",Report1!G58)","v":"#N/A"},{"$f":"IF(Report1!H58=\"\",DATE(1900,1,1),Report1!H58)","v":"1900-01-01"},{"$f":"IF(Report1!I58=\"\",0,Report1!I58)","v":0},"1900-01-01","1900-01-01",0,"1900-01-01","1900-01-01",0,{"$f":"IF(Report1!J58=\"\",\"#N/A\",Report1!J58)","v":"#N/A"}]
[{"$f":"IF(Report1!D59=\"\",0,Report1!D59)","v":0},{"$f":"IF(Report1!E59=\"\",\"#N/A\",Report1!E59)","v":"#N/A"},{"$f":"IF(Report1!F59=\"\",\"#N/A\",Report1!F59)","v":"#N/A"},{"$f":"IF(Report1!G59=\"\",\"#N/A\",Report1!G59)","v":"#N/A"},{"$f":"IF(Report1!H59=\"\",DATE(1900,1,1),Report1!H59)","v":"1900-01-01"},{"$f":"IF(Report1!I59=\"\",0,Report1!I59)","v":0},"1900-01-01","1900-01-01",0,"1900-01-01","1900-01-01",0,{"$f":"IF(Report1!J59=\"\",\"#N/A\",Report1!J59)","v":"#N/A"}]
[{"$f":"IF(Report1!D60=\"\",0,Report1!D60)","v":0},{"$f":"IF(Report1!E60=\"\",\"#N/A\",Report1!E60)","v":"#N/A"},{"$f":"IF(Report1!F60=\"\",\"#N/A\",Report1!F60)","v":"#N/A"},{"$f":"IF(Report1!G60=\"\",\"#N/A\",Report1!G60)","v":"#N/A"},{"$f":"IF(Report1!H60=\"\",DATE(1900,1,1),Report1!H60)","v":"1900-01-01"},{"$f":"IF(Report1!I60=\"\",0,Report1!I60)","v":0},"1900-01-01","1900-01-01",0,"1900-01-01","1900-01-01",0,{"$f":"IF(Report1!J60=\"\",\"#N/A\",Report1!J60)","v":"#N/A"}]
[{"$f":"IF(Report1!D61=\"\",0,Report1!D61)","v":0},{"$f":"IF(Report1!E61=\"\",\"#N/A\",Report1!E61)","v":"#N/A"},{"$f":"IF(Report1!F61=\"\",\"#N/A\",Report1!F61)","v":"#N/A"},{"$f":"IF(Report1!G61=\"\",\"#N/A\",Report1!G61)","v":"#N/A"},{"$f":"IF(Report1!H61=\"\",DATE(1900,1,1),Report1!H61)","v":"1900-01-01"},{"$f":"IF(Report1!I61=\"\",0,Report1!I61)","v":0},"1900-01-01","1900-01-01",0,"1900-01-01","1900-01-01",0,{"$f":"IF(Report1!J61=\"\",\"#N/A\",Report1!J61)","v":"#N/A"}]
[{"$f":"IF(Report1!D62=\"\",0,Report1!D62)","v":0},{"$f":"IF(Report1!E62=\"\",\"#N/A\",Report1!E62)","v":"#N/A"},{"$f":"IF(Report1!F62=\"\",\"#N/A\",Report1!F62)","v":"#N/A"},{"$f":"IF(Report1!G62=\"\",\"#N/A\",Report1!G62)","v":"#N/A"},{"$f":"IF(Report1!H62=\"\",DATE(1900,1,1),Report1!H62)","v":"1900-01-01"},{"$f":"IF(Report1!I62=\"\",0,Report1!I62)","v":0},"1900-01-01","1900-01-01",0,"1900-01-01","1900-01-01",0,{"$f":"IF(Report1!J62=\"\",\"#N/A\",Report1!J62)","v":"#N/A"}]
[{"$f":"IF(Report1!D63=\"\",0,Report1!D63)","v":0},{"$f":"IF(Report1!E63=\"\",\"#N/A\",Report1!E63)","v":"#N/A"},{"$f":"IF(Report1!F63=\"\",\"#N/A\",Report1!F63)","v":"#N/A"},{"$f":"IF(Report1!G63=\"\",\"#N/A\",Report1!G63)","v":"#N/A"},{"$f":"IF(Report1!H63=\"\",DATE(1900,1,1),Report1!H63)","v":"1900-01-01"},{"$f":"IF(Report1!I63=\"\",0,Report1!I63)","v":0},"1900-01-01","1900-01-01",0,"1900-01-01","1900-01-01",0,{"$f":"IF(Report1!J63=\"\",\"#N/A\",Report1!J63)","v":"#N/A"}]
[{"$f":"IF(Report1!D64=\"\",0,Report1!D64)","v":0},{"$f":"IF(Report1!E64=\"\",\"#N/A\",Report1!E64)","v":"#N/A"},{"$f":"IF(Report1!F64=\"\",\"#N/A\",Report1!F64)","v":"#N/A"},{"$f":"IF(Report1!G64=\"\",\"#N/A\",Report1!G64)","v":"#N/A"},{"$f":"IF(Report1!H64=\"\",DATE(1900,1,1),Report1!H64)","v":"1900-01-01"},{"$f":"IF(Report1!I64=\"\",0,Report1!I64)","v":0},"1900-01-01","1900-01-01",0,"1900-01-01","1900-01-01",0,{"$f":"IF(Report1!J64=\"\",\"#N/A\",Report1!J64)","v":"#N/A"}]
[{"$f":"IF(Report1!D65=\"\",0,Report1!D65)","v":0},{"$f":"IF(Report1!E65=\"\",\"#N/A\",Report1!E65)","v":"#N/A"},{"$f":"IF(Report1!F65=\"\",\"#N/A\",Report1!F65)","v":"#N/A"},{"$f":"IF(Report1!G65=\"\",\"#N/A\",Report1!G65)","v":"#N/A"},{"$f":"IF(Report1!H65=\"\",DATE(1900,1,1),Report1!H65)","v":"1900-01-01"},{"$f":"IF(Report1!I65=\"\",0,Report1!I65)","v":0},"1900-01-01","1900-01-01",0,"1900-01-01","1900-01-01",0,{"$f":"IF(Report1!J65=\"\",\"#N/A\",Report1!J65)","v":"#N/A"}]
[{"$f":"IF(Report1!D66=\"\",0,Report1!D66)","v":0},{"$f":"IF(Report1!E66=\"\",\"#N/A\",Report1!E66)","v":"#N/A"},{"$f":"IF(Report1!F66=\"\",\"#N/A\",Report1!F66)","v":"#N/A"},{"$f":"IF(Report1!G66=\"\",\"#N/A\",Report1!G66)","v":"#N/A"},{"$f":"IF(Report1!H66=\"\",DATE(1900,1,1),Report1!H66)","v":"1900-01-01"},{"$f":"IF(Report1!I66=\"\",0,Report1!I66)","v":0},"1900-01-01","1900-01-01",0,"1900-01-01","1900-01-01",0,{"$f":"IF(Report1!J66=\"\",\"#N/A\",Report1!J66)","v":"#N/A"}]
[{"$f":"IF(Report1!D67=\"\",0,Report1!D67)","v":0},{"$f":"IF(Report1!E67=\"\",\"#N/A\",Report1!E67)","v":"#N/A"},{"$f":"IF(Report1!F67=\"\",\"#N/A\",Report1!F67)","v":"#N/A"},{"$f":"IF(Report1!G67=\"\",\"#N/A\",Report1!G67)","v":"#N/A"},{"$f":"IF(Report1!H67=\"\",DATE(1900,1,1),Report1!H67)","v":"1900-01-01"},{"$f":"IF(Report1!I67=\"\",0,Report1!I67)","v":0},"1900-01-01","1900-01-01",0,"1900-01-01","1900-01-01",0,{"$f":"IF(Report1!J67=\"\",\"#N/A\",Report1!J67)","v":"#N/A"}]
[{"$f":"IF(Report1!D68=\"\",0,Report1!D68)","v":0},{"$f":"IF(Report1!E68=\"\",\"#N/A\",Report1!E68)","v":"#N/A"},{"$f":"IF(Report1!F68=\"\",\"#N/A\",Report1!F68)","v":"#N/A"},{"$f":"IF(Report1!G68=\"\",\"#N/A\",Report1!G68)","v":"#N/A"},{"$f":"IF(Report1!H68=\"\",DATE(1900,1,1),Report1!H68)","v":"1900-01-01"},{"$f":"IF(Report1!I68=\"\",0,Report1!I68)","v":0},"1900-01-01","1900-01-01",0,"1900-01-01","1900-01-01",0,{"$f":"IF(Report1!J68=\"\",\"#N/A\",Report1!J68)","v":"#N/A"}]
[{"$f":"IF(Report1!D69=\"\",0,Report1!D69)","v":0},{"$f":"IF(Report1!E69=\"\",\"#N/A\",Report1!E69)","v":"#N/A"},{"$f":"IF(Report1!F69=\"\",\"#N/A\",Report1!F69)","v":"#N/A"},{"$f":"IF(Report1!G69=\"\",\"#N/A\",Report1!G69)","v":"#N/A"},{"$f":"IF(Report1!H69=\"\",DATE(1900,1,1),Report1!H69)","v":"1900-01-01"},{"$f":"IF(Report1!I69=\"\",0,Report1!I69)","v":0},"1900-01-01","1900-01-01",0,"1900-01-01","1900-01-01",0,{"$f":"IF(Report1!J69=\"\",\"#N/A\",Report1!J69)","v":"#N/A"}]
[{"$f":"IF(Report1!D70=\"\",0,Report1!D70)","v":0},{"$f":"IF(Report1!E70=\"\",\"#N/A\",Report1!E70)","v":"#N/A"},{"$f":"IF(Report1!F70=\"\",\"#N/A\",Report1!F70)","v":"#N/A"},{"$f":"IF(Report1!G70=\"\",\"#N/A\",Report1!G70)","v":"#N/A"},{"$f":"IF(Report1!H70=\"\",DATE(1900,1,1),Report1!H70)","v":"1900-01-01"},{"$f":"IF(Report1!I70=\"\",0,Report1!I70)","v":0},"1900-01-01","1900-01-01",0,"1900-01-01","1900-01-01",0,{"$f":"IF(Report1!J70=\"\",\"#N/A\",Report1!J70)","v":"#N/A"}]
[{"$f":"IF(Report1!D71=\"\",0,Report1!D71)","v":0},{"$f":"IF(Report1!E71=\"\",\"#N/A\",Report1!E71)","v":"#N/A"},{"$f":"IF(Report1!F71=\"\",\"#N/A\",Report1!F71)","v":"#N/A"},{"$f":"IF(Report1!G71=\"\",\"#N/A\",Report1!G71)","v":"#N/A"},{"$f":"IF(Report1!H71=\"\",DATE(1900,1,1),Report1!H71)","v":"1900-01-01"},{"$f":"IF(Report1!I71=\"\",0,Report1!I71)","v":0},"1900-01-01","1900-01-01",0,"1900-01-01","1900-01-01",0,{"$f":"IF(Report1!J71=\"\",\"#N/A\",Report1!J71)","v":"#N/A"}]
[{"$f":"IF(Report1!D72=\"\",0,Report1!D72)","v":0},{"$f":"IF(Report1!E72=\"\",\"#N/A\",Report1!E72)","v":"#N/A"},{"$f":"IF(Report1!F72=\"\",\"#N/A\",Report1!F72)","v":"#N/A"},{"$f":"IF(Report1!G72=\"\",\"#N/A\",Report1!G72)","v":"#N/A"},{"$f":"IF(Report1!H72=\"\",DATE(1900,1,1),Report1!H72)","v":"1900-01-01"},{"$f":"IF(Report1!I72=\"\",0,Report1!I72)","v":0},"1900-01-01","1900-01-01",0,"1900-01-01","1900-01-01",0,{"$f":"IF(Report1!J72=\"\",\"#N/A\",Report1!J72)","v":"#N/A"}]
[{"$f":"IF(Report1!D73=\"\",0,Report1!D73)","v":0},{"$f":"IF(Report1!E73=\"\",\"#N/A\",Report1!E73)","v":"#N/A"},{"$f":"IF(Report1!F73=\"\",\"#N/A\",Report1!F73)","v":"#N/A"},{"$f":"IF(Report1!G73=\"\",\"#N/A\",Report1!G73)","v":"#N/A"},{"$f":"IF(Report1!H73=\"\",DATE(1900,1,1),Report1!H73)","v":"1900-01-01"},{"$f":"IF(Report1!I73=\"\",0,Report1!I73)","v":0},"1900-01-01","1900-01-01",0,"1900-01-01","1900-01-01",0,{"$f":"IF(Report1!J73=\"\",\"#N/A\",Report1!J73)","v":"#N/A"}]
[{"$f":"IF(Report1!D74=\"\",0,Report1!D74)","v":0},{"$f":"IF(Report1!E74=\"\",\"#N/A\",Report1!E74)","v":"#N/A"},{"$f":"IF(Report1!F74=\"\",\"#N/A\",Report1!F74)","v":"#N/A"},{"$f":"IF(Report1!G74=\"\",\"#N/A\",Report1!G74)","v":"#N/A"},{"$f":"IF(Report1!H74=\"\",DATE(1900,1,1),Report1!H74)","v":"1900-01-01"},{"$f":"IF(Report1!I74=\"\",0,Report1!I74)","v":0},"1900-01-01","1900-01-01",0,"1900-01-01","1900-01-01",0,{"$f":"IF(Report1!J74=\"\",\"#N/A\",Report1!J74)","v":"#N/A"}]
[{"$f":"IF(Report1!D75=\"\",0,Report1!D75)","v":0},{"$f":"IF(Report1!E75=\"\",\"#N/A\",Report1!E75)","v":"#N/A"},{"$f":"IF(Report1!F75=\"\",\"#N/A\",Report1!F75)","v":"#N/A"},{"$f":"IF(Report1!G75=\"\",\"#N/A\",Report1!G75)","v":"#N/A"},{"$f":"IF(Report1!H75=\"\",DATE(1900,1,1),Report1!H75)","v":"1900-01-01"},{"$f":"IF(Report1!I75=\"\",0,Report1!I75)","v":0},"1900-01-01","1900-01-01",0,"1900-01-01","1900-01-01",0,{"$f":"IF(Report1!J75=\"\",\"#N/A\",Report1!J75)","v":"#N/A"}]
[{"$f":"IF(Report1!D76=\"\",0,Report1!D76)","v":0},{"$f":"IF(Report1!E76=\"\",\"#N/A\",Report1!E76)","v":"#N/A"},{"$f":"IF(Report1!F76=\"\",\"#N/A\",Report1!F76)","v":"#N/A"},{"$f":"IF(Report1!G76=\"\",\"#N/A\",Report1!G76)","v":"#N/A"},{"$f":"IF(Report1!H76=\"\",DATE(1900,1,1),Report1!H76)","v":"1900-01-01"},{"$f":"IF(Report1!I76=\"\",0,Report1!I76)","v":0},"1900-01-01","1900-01-01",0,"1900-01-01","1900-01-01",0,{"$f":"IF(Report1!J76=\"\",\"#N/A\",Report1!J76)","v":"#N/A"}]
[{"$f":"IF(Report1!D77=\"\",0,Report1!D77)","v":0},{"$f":"IF(Report1!E77=\"\",\"#N/A\",Report1!E77)","v":"#N/A"},{"$f":"IF(Report1!F77=\"\",\"#N/A\",Report1!F77)","v":"#N/A"},{"$f":"IF(Report1!G77=\"\",\"#N/A\",Report1!G77)","v":"#N/A"},{"$f":"IF(Report1!H77=\"\",DATE(1900,1,1),Report1!H77)","v":"1900-01-01"},{"$f":"IF(Report1!I77=\"\",0,Report1!I77)","v":0},"1900-01-01","1900-01-01",0,"1900-01-01","1900-01-01",0,{"$f":"IF(Report1!J77=\"\",\"#N/A\",Report1!J77)","v":"#N/A"}]
[{"$f":"IF(Report1!D78=\"\",0,Report1!D78)","v":0},{"$f":"IF(Report1!E78=\"\",\"#N/A\",Report1!E78)","v":"#N/A"},{"$f":"IF(Report1!F78=\"\",\"#N/A\",Report1!F78)","v":"#N/A"},{"$f":"IF(Report1!G78=\"\",\"#N/A\",Report1!G78)","v":"#N/A"},{"$f":"IF(Report1!H78=\"\",DATE(1900,1,1),Report1!H78)","v":"1900-01-01"},{"$f":"IF(Report1!I78=\"\",0,Report1!I78)","v":0},{"$f":"DATE(1900,1,1)","v":"1900-01-01"},"1900-01-01",0,{"$f":"DATE(1900,1,1)","v":"1900-01-01"},"1900-01-01",0,{"$f":"IF(Report1!J78=\"\",\"#N/A\",Report1!J78)","v":"#N/A"}]
[{"$f":"IF(Report1!D79=\"\",0,Report1!D79)","v":0},{"$f":"IF(Report1!E79=\"\",\"#N/A\",Report1!E79)","v":"#N/A"},{"$f":"IF(Report1!F79=\"\",\"#N/A\",Report1!F79)","v":"#N/A"},{"$f":"IF(Report1!G79=\"\",\"#N/A\",Report1!G79)","v":"#N/A"},{"$f":"IF(Report1!H79=\"\",DATE(1900,1,1),Report1!H79)","v":"1900-01-01"},{"$f":"IF(Report1!I79=\"\",0,Report1!I79)","v":0},"1900-01-01","1900-01-01",0,"1900-01-01","1900-01-01",0,{"$f":"IF(Report1!J79=\"\",\"#N/A\",Report1!J79)","v":"#N/A"}]
[{"$f":"IF(Report1!D80=\"\",0,Report1!D80)","v":0},{"$f":"IF(Report1!E80=\"\",\"#N/A\",Report1!E80)","v":"#N/A"},{"$f":"IF(Report1!F80=\"\",\"#N/A\",Report1!F80)","v":"#N/A"},{"$f":"IF(Report1!G80=\"\",\"#N/A\",Report1!G80)","v":"#N/A"},{"$f":"IF(Report1!H80=\"\",DATE(1900,1,1),Report1!H80)","v":"1900-01-01"},{"$f":"IF(Report1!I80=\"\",0,Report1!I80)","v":0},"1900-01-01","1900-01-01",0,"1900-01-01","1900-01-01",0,{"$f":"IF(Report1!J80=\"\",\"#N/A\",Report1!J80)","v":"#N/A"}]
[{"$f":"IF(Report1!D81=\"\",0,Report1!D81)","v":0},{"$f":"IF(Report1!E81=\"\",\"#N/A\",Report1!E81)","v":"#N/A"},{"$f":"IF(Report1!F81=\"\",\"#N/A\",Report1!F81)","v":"#N/A"},{"$f":"IF(Report1!G81=\"\",\"#N/A\",Report1!G81)","v":"#N/A"},{"$f":"IF(Report1!H81=\"\",DATE(1900,1,1),Report1!H81)","v":"1900-01-01"},{"$f":"IF(Report1!I81=\"\",0,Report1!I81)","v":0},"1900-01-01","1900-01-01",0,"1900-01-01","1900-01-01",0,{"$f":"IF(Report1!J81=\"\",\"#N/A\",Report1!J81)","v":"#N/A"}]
[{"$f":"IF(Report1!D82=\"\",0,Report1!D82)","v":0},{"$f":"IF(Report1!E82=\"\",\"#N/A\",Report1!E82)","v":"#N/A"},{"$f":"IF(Report1!F82=\"\",\"#N/A\",Report1!F82)","v":"#N/A"},{"$f":"IF(Report1!G82=\"\",\"#N/A\",Report1!G82)","v":"#N/A"},{"$f":"IF(Report1!H82=\"\",DATE(1900,1,1),Report1!H82)","v":"1900-01-01"},{"$f":"IF(Report1!I82=\"\",0,Report1!I82)","v":0},"1900-01-01","1900-01-01",0,"1900-01-01","1900-01-01",0,{"$f":"IF(Report1!J82=\"\",\"#N/A\",Report1!J82)","v":"#N/A"}]
[{"$f":"IF(Report1!D83=\"\",0,Report1!D83)","v":0},{"$f":"IF(Report1!E83=\"\",\"#N/A\",Report1!E83)","v":"#N/A"},{"$f":"IF(Report1!F83=\"\",\"#N/A\",Report1!F83)","v":"#N/A"},{"$f":"IF(Report1!G83=\"\",\"#N/A\",Report1!G83)","v":"#N/A"},{"$f":"IF(Report1!H83=\"\",DATE(1900,1,1),Report1!H83)","v":"1900-01-01"},{"$f":"IF(Report1!I83=\"\",0,Report1!I83)","v":0},"1900-01-01","1900-01-01",0,"1900-01-01","1900-01-01",0,{"$f":"IF(Report1!J83=\"\",\"#N/A\",Report1!J83)","v":"#N/A"}]
[{"$f":"IF(Report1!D84=\"\",0,Report1!D84)","v":0},{"$f":"IF(Report1!E84=\"\",\"#N/A\",Report1!E84)","v":"#N/A"},{"$f":"IF(Report1!F84=\"\",\"#N/A\",Report1!F84)","v":"#N/A"},{"$f":"IF(Report1!G84=\"\",\"#N/A\",Report1!G84)","v":"#N/A"},{"$f":"IF(Report1!H84=\"\",DATE(1900,1,1),Report1!H84)","v":"1900-01-01"},{"$f":"IF(Report1!I84=\"\",0,Report1!I84)","v":0},"1900-01-01","1900-01-01",0,"1900-01-01","1900-01-01",0,{"$f":"IF(Report1!J84=\"\",\"#N/A\",Report1!J84)","v":"#N/A"}]
[{"$f":"IF(Report1!D85=\"\",0,Report1!D85)","v":0},{"$f":"IF(Report1!E85=\"\",\"#N/A\",Report1!E85)","v":"#N/A"},{"$f":"IF(Report1!F85=\"\",\"#N/A\",Report1!F85)","v":"#N/A"},{"$f":"IF(Report1!G85=\"\",\"#N/A\",Report1!G85)","v":"#N/A"},{"$f":"IF(Report1!H85=\"\",DATE(1900,1,1),Report1!H85)","v":"1900-01-01"},{"$f":"IF(Report1!I85=\"\",0,Report1!I85)","v":0},"1900-01-01","1900-01-01",0,"1900-01-01","1900-01-01",0,{"$f":"IF(Report1!J85=\"\",\"#N/A\",Report1!J85)","v":"#N/A"}]
[{"$f":"IF(Report1!D86=\"\",0,Report1!D86)","v":0},{"$f":"IF(Report1!E86=\"\",\"#N/A\",Report1!E86)","v":"#N/A"},{"$f":"IF(Report1!F86=\"\",\"#N/A\",Report1!F86)","v":"#N/A"},{"$f":"IF(Report1!G86=\"\",\"#N/A\",Report1!G86)","v":"#N/A"},{"$f":"IF(Report1!H86=\"\",DATE(1900,1,1),Report1!H86)","v":"1900-01-01"},{"$f":"IF(Report1!I86=\"\",0,Report1!I86)","v":0},"1900-01-01","1900-01-01",0,"1900-01-01","1900-01-01",0,{"$f":"IF(Report1!J86=\"\",\"#N/A\",Report1!J86)","v":"#N/A"}]
[{"$f":"IF(Report1!D87=\"\",0,Report1!D87)","v":0},{"$f":"IF(Report1!E87=\"\",\"#N/A\",Report1!E87)","v":"#N/A"},{"$f":"IF(Report1!F87=\"\",\"#N/A\",Report1!F87)","v":"#N/A"},{"$f":"IF(Report1!G87=\"\",\"#N/A\",Report1!G87)","v":"#N/A"},{"$f":"IF(Report1!H87=\"\",DATE(1900,1,1),Report1!H87)","v":"1900-01-01"},{"$f":"IF(Report1!I87=\"\",0,Report1!I87)","v":0},"1900-01-01","1900-01-01",0,"1900-01-01","1900-01-01",0,{"$f":"IF(Report1!J87=\"\",\"#N/A\",Report1!J87)","v":"#N/A"}]
[{"$f":"IF(Report1!D88=\"\",0,Report1!D88)","v":0},{"$f":"IF(Report1!E88=\"\",\"#N/A\",Report1!E88)","v":"#N/A"},{"$f":"IF(Report1!F88=\"\",\"#N/A\",Report1!F88)","v":"#N/A"},{"$f":"IF(Report1!G88=\"\",\"#N/A\",Report1!G88)","v":"#N/A"},{"$f":"IF(Report1!H88=\"\",DATE(1900,1,1),Report1!H88)","v":"1900-01-01"},{"$f":"IF(Report1!I88=\"\",0,Report1!I88)","v":0},"1900-01-01","1900-01-01",0,"1900-01-01","1900-01-01",0,{"$f":"IF(Report1!J88=\"\",\"#N/A\",Report1!J88)","v":"#N/A"}]
[{"$f":"IF(Report1!D89=\"\",0,Report1!D89)","v":0},{"$f":"IF(Report1!E89=\"\",\"#N/A\",Report1!E89)","v":"#N/A"},{"$f":"IF(Report1!F89=\"\",\"#N/A\",Report1!F89)","v":"#N/A"},{"$f":"IF(Report1!G89=\"\",\"#N/A\",Report1!G89)","v":"#N/A"},{"$f":"IF(Report1!H89=\"\",DATE(1900,1,1),Report1!H89)","v":"1900-01-01"},{"$f":"IF(Report1!I89=\"\",0,Report1!I89)","v":0},"1900-01-01","1900-01-01",0,"1900-01-01","1900-01-01",0,{"$f":"IF(Report1!J89=\"\",\"#N/A\",Report1!J89)","v":"#N/A"}]
[{"$f":"IF(Report1!D90=\"\",0,Report1!D90)","v":0},{"$f":"IF(Report1!E90=\"\",\"#N/A\",Report1!E90)","v":"#N/A"},{"$f":"IF(Report1!F90=\"\",\"#N/A\",Report1!F90)","v":"#N/A"},{"$f":"IF(Report1!G90=\"\",\"#N/A\",Report1!G90)","v":"#N/A"},{"$f":"IF(Report1!H90=\"\",DATE(1900,1,1),Report1!H90)","v":"1900-01-01"},{"$f":"IF(Report1!I90=\"\",0,Report1!I90)","v":0},"1900-01-01","1900-01-01",0,"1900-01-01","1900-01-01",0,{"$f":"IF(Report1!J90=\"\",\"#N/A\",Report1!J90)","v":"#N/A"}]
[{"$f":"IF(Report1!D91=\"\",0,Report1!D91)","v":0},{"$f":"IF(Report1!E91=\"\",\"#N/A\",Report1!E91)","v":"#N/A"},{"$f":"IF(Report1!F91=\"\",\"#N/A\",Report1!F91)","v":"#N/A"},{"$f":"IF(Report1!G91=\"\",\"#N/A\",Report1!G91)","v":"#N/A"},{"$f":"IF(Report1!H91=\"\",DATE(1900,1,1),Report1!H91)","v":"1900-01-01"},{"$f":"IF(Report1!I91=\"\",0,Report1!I91)","v":0},"1900-01-01","1900-01-01",0,"1900-01-01","1900-01-01",0,{"$f":"IF(Report1!J91=\"\",\"#N/A\",Report1!J91)","v":"#N/A"}]
[{"$f":"IF(Report1!D92=\"\",0,Report1!D92)","v":0},{"$f":"IF(Report1!E92=\"\",\"#N/A\",Report1!E92)","v":"#N/A"},{"$f":"IF(Report1!F92=\"\",\"#N/A\",Report1!F92)","v":"#N/A"},{"$f":"IF(Report1!G92=\"\",\"#N/A\",Report1!G92)","v":"#N/A"},{"$f":"IF(Report1!H92=\"\",DATE(1900,1,1),Report1!H92)","v":"1900-01-01"},{"$f":"IF(Report1!I92=\"\",0,Report1!I92)","v":0},"1900-01-01","1900-01-01",0,"1900-01-01","1900-01-01",0,{"$f":"IF(Report1!J92=\"\",\"#N/A\",Report1!J92)","v":"#N/A"}]
[{"$f":"IF(Report1!D93=\"\",0,Report1!D93)","v":0},{"$f":"IF(Report1!E93=\"\",\"#N/A\",Report1!E93)","v":"#N/A"},{"$f":"IF(Report1!F93=\"\",\"#N/A\",Report1!F93)","v":"#N/A"},{"$f":"IF(Report1!G93=\"\",\"#N/A\",Report1!G93)","v":"#N/A"},{"$f":"IF(Report1!H93=\"\",DATE(1900,1,1),Report1!H93)","v":"1900-01-01"},{"$f":"IF(Report1!I93=\"\",0,Report1!I93)","v":0},"1900-01-01","1900-01-01",0,"1900-01-01","1900-01-01",0,{"$f":"IF(Report1!J93=\"\",\"#N/A\",Report1!J93)","v":"#N/A"}]
[{"$f":"IF(Report1!D94=\"\",0,Report1!D94)","v":0},{"$f":"IF(Report1!E94=\"\",\"#N/A\",Report1!E94)","v":"#N/A"},{"$f":"IF(Report1!F94=\"\",\"#N/A\",Report1!F94)","v":"#N/A"},{"$f":"IF(Report1!G94=\"\",\"#N/A\",Report1!G94)","v":"#N/A"},{"$f":"IF(Report1!H94=\"\",DATE(1900,1,1),Report1!H94)","v":"1900-01-01"},{"$f":"IF(Report1!I94=\"\",0,Report1!I94)","v":0},"1900-01-01","1900-01-01",0,"1900-01-01","1900-01-01",0,{"$f":"IF(Report1!J94=\"\",\"#N/A\",Report1!J94)","v":"#N/A"}]
[{"$f":"IF(Report1!D95=\"\",0,Report1!D95)","v":0},{"$f":"IF(Report1!E95=\"\",\"#N/A\",Report1!E95)","v":"#N/A"},{"$f":"IF(Report1!F95=\"\",\"#N/A\",Report1!F95)","v":"#N/A"},{"$f":"IF(Report1!G95=\"\",\"#N/A\",Report1!G95)","v":"#N/A"},{"$f":"IF(Report1!H95=\"\",DATE(1900,1,1),Report1!H95)","v":"1900-01-01"},{"$f":"IF(Report1!I95=\"\",0,Report1!I95)","v":0},"1900-01-01","1900-01-01",0,"1900-01-01","1900-01-01",0,{"$f":"IF(Report1!J95=\"\",\"#N/A\",Report1!J95)","v":"#N/A"}]
[{"$f":"IF(Report1!D96=\"\",0,Report1!D96)","v":0},{"$f":"IF(Report1!E96=\"\",\"#N/A\",Report1!E96)","v":"#N/A"},{"$f":"IF(Report1!F96=\"\",\"#N/A\",Report1!F96)","v":"#N/A"},{"$f":"IF(Report1!G96=\"\",\"#N/A\",Report1!G96)","v":"#N/A"},{"$f":"IF(Report1!H96=\"\",DATE(1900,1,1),Report1!H96)","v":"1900-01-01"},{"$f":"IF(Report1!I96=\"\",0,Report1!I96)","v":0},"1900-01-01","1900-01-01",0,"1900-01-01","1900-01-01",0,{"$f":"IF(Report1!J96=\"\",\"#N/A\",Report1!J96)","v":"#N/A"}]
[{"$f":"IF(Report1!D97=\"\",0,Report1!D97)","v":0},{"$f":"IF(Report1!E97=\"\",\"#N/A\",Report1!E97)","v":"#N/A"},{"$f":"IF(Report1!F97=\"\",\"#N/A\",Report1!F97)","v":"#N/A"},{"$f":"IF(Report1!G97=\"\",\"#N/A\",Report1!G97)","v":"#N/A"},{"$f":"IF(Report1!H97=\"\",DATE(1900,1,1),Report1!H97)","v":"1900-01-01"},{"$f":"IF(Report1!I97=\"\",0,Report1!I97)","v":0},"1900-01-01","1900-01-01",0,"1900-01-01","1900-01-01",0,{"$f":"IF(Report1!J97=\"\",\"#N/A\",Report1!J97)","v":"#N/A"}]
[{"$f":"IF(Report1!D98=\"\",0,Report1!D98)","v":0},{"$f":"IF(Report1!E98=\"\",\"#N/A\",Report1!E98)","v":"#N/A"},{"$f":"IF(Report1!F98=\"\",\"#N/A\",Report1!F98)","v":"#N/A"},{"$f":"IF(Report1!G98=\"\",\"#N/A\",Report1!G98)","v":"#N/A"},{"$f":"IF(Report1!H98=\"\",DATE(1900,1,1),Report1!H98)","v":"1900-01-01"},{"$f":"IF(Report1!I98=\"\",0,Report1!I98)","v":0},"1900-01-01","1900-01-01",0,"1900-01-01","1900-01-01",0,{"$f":"IF(Report1!J98=\"\",\"#N/A\",Report1!J98)","v":"#N/A"}]
[{"$f":"IF(Report1!D99=\"\",0,Report1!D99)","v":0},{"$f":"IF(Report1!E99=\"\",\"#N/A\",Report1!E99)","v":"#N/A"},{"$f":"IF(Report1!F99=\"\",\"#N/A\",Report1!F99)","v":"#N/A"},{"$f":"IF(Report1!G99=\"\",\"#N/A\",Report1!G99)","v":"#N/A"},{"$f":"IF(Report1!H99=\"\",DATE(1900,1,1),Report1!H99)","v":"1900-01-01"},{"$f":"IF(Report1!I99=\"\",0,Report1!I99)","v":0},"1900-01-01","1900-01-01",0,"1900-01-01","1900-01-01",0,{"$f":"IF(Report1!J99=\"\",\"#N/A\",Report1!J99)","v":"#N/A"}]
[{"$f":"IF(Report1!D100=\"\",0,Report1!D100)","v":0},{"$f":"IF(Report1!E100=\"\",\"#N/A\",Report1!E100)","v":"#N/A"},{"$f":"IF(Report1!F100=\"\",\"#N/A\",Report1!F100)","v":"#N/A"},{"$f":"IF(Report1!G100=\"\",\"#N/A\",Report1!G100)","v":"#N/A"},{"$f":"IF(Report1!H100=\"\",DATE(1900,1,1),Report1!H100)","v":"1900-01-01"},{"$f":"IF(Report1!I100=\"\",0,Report1!I100)","v":0},"1900-01-01","1900-01-01",0,"1900-01-01","1900-01-01",0,{"$f":"IF(Report1!J100=\"\",\"#N/A\",Report1!J100)","v":"#N/A"}]
[{"$f":"IF(Report1!D101=\"\",0,Report1!D101)","v":0},{"$f":"IF(Report1!E101=\"\",\"#N/A\",Report1!E101)","v":"#N/A"},{"$f":"IF(Report1!F101=\"\",\"#N/A\",Report1!F101)","v":"#N/A"},{"$f":"IF(Report1!G101=\"\",\"#N/A\",Report1!G101)","v":"#N/A"},{"$f":"IF(Report1!H101=\"\",DATE(1900,1,1),Report1!H101)","v":"1900-01-01"},{"$f":"IF(Report1!I101=\"\",0,Report1!I101)","v":0},"1900-01-01","1900-01-01",0,"1900-01-01","1900-01-01",0,{"$f":"IF(Report1!J101=\"\",\"#N/A\",Report1!J101)","v":"#N/A"}]
[{"$f":"IF(Report1!D102=\"\",0,Report1!D102)","v":0},{"$f":"IF(Report1!E102=\"\",\"#N/A\",Report1!E102)","v":"#N/A"},{"$f":"IF(Report1!F102=\"\",\"#N/A\",Report1!F102)","v":"#N/A"},{"$f":"IF(Report1!G102=\"\",\"#N/A\",Report1!G102)","v":"#N/A"},{"$f":"IF(Report1!H102=\"\",DATE(1900,1,1),Report1!H102)","v":"1900-01-01"},{"$f":"IF(Report1!I102=\"\",0,Report1!I102)","v":0},"1900-01-01","1900-01-01",0,"1900-01-01","1900-01-01",0,{"$f":"IF(Report1!J102=\"\",\"#N/A\",Report1!J102)","v":"#N/A"}]
[{"$f":"IF(Report1!D103=\"\",0,Report1!D103)","v":0},{"$f":"IF(Report1!E103=\"\",\"#N/A\",Report1!E103)","v":"#N/A"},{"$f":"IF(Report1!F103=\"\",\"#N/A\",Report1!F103)","v":"#N/A"},{"$f":"IF(Report1!G103=\"\",\"#N/A\",Report1!G103)","v":"#N/A"},{"$f":"IF(Report1!H103=\"\",DATE(1900,1,1),Report1!H103)","v":"1900-01-01"},{"$f":"IF(Report1!I103=\"\",0,Report1!I103)","v":0},"1900-01-01","1900-01-01",0,"1900-01-01","1900-01-01",0,{"$f":"IF(Report1!J103=\"\",\"#N/A\",Report1!J103)","v":"#N/A"}]
[{"$f":"IF(Report1!D104=\"\",0,Report1!D104)","v":0},{"$f":"IF(Report1!E104=\"\",\"#N/A\",Report1!E104)","v":"#N/A"},{"$f":"IF(Report1!F104=\"\",\"#N/A\",Report1!F104)","v":"#N/A"},{"$f":"IF(Report1!G104=\"\",\"#N/A\",Report1!G104)","v":"#N/A"},{"$f":"IF(Report1!H104=\"\",DATE(1900,1,1),Report1!H104)","v":"1900-01-01"},{"$f":"IF(Report1!I104=\"\",0,Report1!I104)","v":0},"1900-01-01","1900-01-01",0,"1900-01-01","1900-01-01",0,{"$f":"IF(Report1!J104=\"\",\"#N/A\",Report1!J104)","v":"#N/A"}]
[{"$f":"IF(Report1!D105=\"\",0,Report1!D105)","v":0},{"$f":"IF(Report1!E105=\"\",\"#N/A\",Report1!E105)","v":"#N/A"},{"$f":"IF(Report1!F105=\"\",\"#N/A\",Report1!F105)","v":"#N/A"},{"$f":"IF(Report1!G105=\"\",\"#N/A\",Report1!G105)","v":"#N/A"},{"$f":"IF(Report1!H105=\"\",DATE(1900,1,1),Report1!H105)","v":"1900-01-01"},{"$f":"IF(Report1!I105=\"\",0,Report1!I105)","v":0},"1900-01-01","1900-01-01",0,"1900-01-01","1900-01-01",0,{"$f":"IF(Report1!J105=\"\",\"#N/A\",Report1!J105)","v":"#N/A"}]
[{"$f":"IF(Report1!D106=\"\",0,Report1!D106)","v":0},{"$f":"IF(Report1!E106=\"\",\"#N/A\",Report1!E106)","v":"#N/A"},{"$f":"IF(Report1!F106=\"\",\"#N/A\",Report1!F106)","v":"#N/A"},{"$f":"IF(Report1!G106=\"\",\"#N/A\",Report1!G106)","v":"#N/A"},{"$f":"IF(Report1!H106=\"\",DATE(1900,1,1),Report1!H106)","v":"1900-01-01"},{"$f":"IF(Report1!I106=\"\",0,Report1!I106)","v":0},"1900-01-01","1900-01-01",0,"1900-01-01","1900-01-01",0,{"$f":"IF(Report1!J106=\"\",\"#N/A\",Report1!J106)","v":"#N/A"}]
[{"$f":"IF(Report1!D107=\"\",0,Report1!D107)","v":0},{"$f":"IF(Report1!E107=\"\",\"#N/A\",Report1!E107)","v":"#N/A"},{"$f":"IF(Report1!F107=\"\",\"#N/A\",Report1!F107)","v":"#N/A"},{"$f":"IF(Report1!G107=\"\",\"#N/A\",Report1!G107)","v":"#N/A"},{"$f":"IF(Report1!H107=\"\",DATE(1900,1,1),Report1!H107)","v":"1900-01-01"},{"$f":"IF(Report1!I107=\"\",0,Report1!I107)","v":0},"1900-01-01","1900-01-01",0,"1900-01-01","1900-01-01",0,{"$f":"IF(Report1!J107=\"\",\"#N/A\",Report1!J107)","v":"#N/A"}]
[{"$f":"IF(Report1!D108=\"\",0,Report1!D108)","v":0},{"$f":"IF(Report1!E108=\"\",\"#N/A\",Report1!E108)","v":"#N/A"},{"$f":"IF(Report1!F108=\"\",\"#N/A\",Report1!F108)","v":"#N/A"},{"$f":"IF(Report1!G108=\"\",\"#N/A\",Report1!G108)","v":"#N/A"},{"$f":"IF(Report1!H108=\"\",DATE(1900,1,1),Report1!H108)","v":"1900-01-01"},{"$f":"IF(Report1!I108=\"\",0,Report1!I108)","v":0},"1900-01-01","1900-01-01",0,"1900-01-01","1900-01-01",0,{"$f":"IF(Report1!J108=\"\",\"#N/A\",Report1!J108)","v":"#N/A"}]
[{"$f":"IF(Report1!D109=\"\",0,Report1!D109)","v":0},{"$f":"IF(Report1!E109=\"\",\"#N/A\",Report1!E109)","v":"#N/A"},{"$f":"IF(Report1!F109=\"\",\"#N/A\",Report1!F109)","v":"#N/A"},{"$f":"IF(Report1!G109=\"\",\"#N/A\",Report1!G109)","v":"#N/A"},{"$f":"IF(Report1!H109=\"\",DATE(1900,1,1),Report1!H109)","v":"1900-01-01"},{"$f":"IF(Report1!I109=\"\",0,Report1!I109)","v":0},"1900-01-01","1900-01-01",0,"1900-01-01","1900-01-01",0,{"$f":"IF(Report1!J109=\"\",\"#N/A\",Report1!J109)","v":"#N/A"}]
[{"$f":"IF(Report1!D110=\"\",0,Report1!D110)","v":0},{"$f":"IF(Report1!E110=\"\",\"#N/A\",Report1!E110)","v":"#N/A"},{"$f":"IF(Report1!F110=\"\",\"#N/A\",Report1!F110)","v":"#N/A"},{"$f":"IF(Report1!G110=\"\",\"#N/A\",Report1!G110)","v":"#N/A"},{"$f":"IF(Report1!H110=\"\",DATE(1900,1,1),Report1!H110)","v":"1900-01-01"},{"$f":"IF(Report1!I110=\"\",0,Report1!I110)","v":0},"1900-01-01","1900-01-01",0,"1900-01-01","1900-01-01",0,{"$f":"IF(Report1!J110=\"\",\"#N/A\",Report1!J110)","v":"#N/A"}]
[{"$f":"IF(Report1!D111=\"\",0,Report1!D111)","v":0},{"$f":"IF(Report1!E111=\"\",\"#N/A\",Report1!E111)","v":"#N/A"},{"$f":"IF(Report1!F111=\"\",\"#N/A\",Report1!F111)","v":"#N/A"},{"$f":"IF(Report1!G111=\"\",\"#N/A\",Report1!G111)","v":"#N/A"},{"$f":"IF(Report1!H111=\"\",DATE(1900,1,1),Report1!H111)","v":"1900-01-01"},{"$f":"IF(Report1!I111=\"\",0,Report1!I111)","v":0},"1900-01-01","1900-01-01",0,"1900-01-01","1900-01-01",0,{"$f":"IF(Report1!J111=\"\",\"#N/A\",Report1!J111)","v":"#N/A"}]
[{"$f":"IF(Report1!D112=\"\",0,Report1!D112)","v":0},{"$f":"IF(Report1!E112=\"\",\"#N/A\",Report1!E112)","v":"#N/A"},{"$f":"IF(Report1!F112=\"\",\"#N/A\",Report1!F112)","v":"#N/A"},{"$f":"IF(Report1!G112=\"\",\"#N/A\",Report1!G112)","v":"#N/A"},{"$f":"IF(Report1!H112=\"\",DATE(1900,1,1),Report1!H112)","v":"1900-01-01"},{"$f":"IF(Report1!I112=\"\",0,Report1!I112)","v":0},"1900-01-01","1900-01-01",0,"1900-01-01","1900-01-01",0,{"$f":"IF(Report1!J112=\"\",\"#N/A\",Report1!J112)","v":"#N/A"}]
[{"$f":"IF(Report1!D113=\"\",0,Report1!D113)","v":0},{"$f":"IF(Report1!E113=\"\",\"#N/A\",Report1!E113)","v":"#N/A"},{"$f":"IF(Report1!F113=\"\",\"#N/A\",Report1!F113)","v":"#N/A"},{"$f":"IF(Report1!G113=\"\",\"#N/A\",Report1!G113)","v":"#N/A"},{"$f":"IF(Report1!H113=\"\",DATE(1900,1,1),Report1!H113)","v":"1900-01-01"},{"$f":"IF(Report1!I113=\"\",0,Report1!I113)","v":0},"1900-01-01","1900-01-01",0,"1900-01-01","1900-01-01",0,{"$f":"IF(Report1!J113=\"\",\"#N/A\",Report1!J113)","v":"#N/A"}]
[{"$f":"IF(Report1!D114=\"\",0,Report1!D114)","v":0},{"$f":"IF(Report1!E114=\"\",\"#N/A\",Report1!E114)","v":"#N/A"},{"$f":"IF(Report1!F114=\"\",\"#N/A\",Report1!F114)","v":"#N/A"},{"$f":"IF(Report1!G114=\"\",\"#N/A\",Report1!G114)","v":"#N/A"},{"$f":"IF(Report1!H114=\"\",DATE(1900,1,1),Report1!H114)","v":"1900-01-01"},{"$f":"IF(Report1!I114=\"\",0,Report1!I114)","v":0},"1900-01-01","1900-01-01",0,"1900-01-01","1900-01-01",0,{"$f":"IF(Report1!J114=\"\",\"#N/A\",Report1!J114)","v":"#N/A"}]
[{"$f":"IF(Report1!D115=\"\",0,Report1!D115)","v":0},{"$f":"IF(Report1!E115=\"\",\"#N/A\",Report1!E115)","v":"#N/A"},{"$f":"IF(Report1!F115=\"\",\"#N/A\",Report1!F115)","v":"#N/A"},{"$f":"IF(Report1!G115=\"\",\"#N/A\",Report1!G115)","v":"#N/A"},{"$f":"IF(Report1!H115=\"\",DATE(1900,1,1),Report1!H115)","v":"1900-01-01"},{"$f":"IF(Report1!I115=\"\",0,Report1!I115)","v":0},"1900-01-01","1900-01-01",0,"1900-01-01","1900-01-01",0,{"$f":"IF(Report1!J115=\"\",\"#N/A\",Report1!J115)","v":"#N/A"}]
[{"$f":"IF(Report1!D116=\"\",0,Report1!D116)","v":0},{"$f":"IF(Report1!E116=\"\",\"#N/A\",Report1!E116)","v":"#N/A"},{"$f":"IF(Report1!F116=\"\",\"#N/A\",Report1!F116)","v":"#N/A"},{"$f":"IF(Report1!G116=\"\",\"#N/A\",Report1!G116)","v":"#N/A"},{"$f":"IF(Report1!H116=\"\",DATE(1900,1,1),Report1!H116)","v":"1900-01-01"},{"$f":"IF(Report1!I116=\"\",0,Report1!I116)","v":0},"1900-01-01","1900-01-01",0,"1900-01-01","1900-01-01",0,{"$f":"IF(Report1!J116=\"\",\"#N/A\",Report1!J116)","v":"#N/A"}]
[{"$f":"IF(Report1!D117=\"\",0,Report1!D117)","v":0},{"$f":"IF(Report1!E117=\"\",\"#N/A\",Report1!E117)","v":"#N/A"},{"$f":"IF(Report1!F117=\"\",\"#N/A\",Report1!F117)","v":"#N/A"},{"$f":"IF(Report1!G117=\"\",\"#N/A\",Report1!G117)","v":"#N/A"},{"$f":"IF(Report1!H117=\"\",DATE(1900,1,1),Report1!H117)","v":"1900-01-01"},{"$f":"IF(Report1!I117=\"\",0,Report1!I117)","v":0},"1900-01-01","1900-01-01",0,"1900-01-01","1900-01-01",0,{"$f":"IF(Report1!J117=\"\",\"#N/A\",Report1!J117)","v":"#N/A"}]
[{"$f":"IF(Report1!D118=\"\",0,Report1!D118)","v":0},{"$f":"IF(Report1!E118=\"\",\"#N/A\",Report1!E118)","v":"#N/A"},{"$f":"IF(Report1!F118=\"\",\"#N/A\",Report1!F118)","v":"#N/A"},{"$f":"IF(Report1!G118=\"\",\"#N/A\",Report1!G118)","v":"#N/A"},{"$f":"IF(Report1!H118=\"\",DATE(1900,1,1),Report1!H118)","v":"1900-01-01"},{"$f":"IF(Report1!I118=\"\",0,Report1!I118)","v":0},"1900-01-01","1900-01-01",0,"1900-01-01","1900-01-01",0,{"$f":"IF(Report1!J118=\"\",\"#N/A\",Report1!J118)","v":"#N/A"}]
[{"$f":"IF(Report1!D119=\"\",0,Report1!D119)","v":0},{"$f":"IF(Report1!E119=\"\",\"#N/A\",Report1!E119)","v":"#N/A"},{"$f":"IF(Report1!F119=\"\",\"#N/A\",Report1!F119)","v":"#N/A"},{"$f":"IF(Report1!G119=\"\",\"#N/A\",Report1!G119)","v":"#N/A"},{"$f":"IF(Report1!H119=\"\",DATE(1900,1,1),Report1!H119)","v":"1900-01-01"},{"$f":"IF(Report1!I119=\"\",0,Report1!I119)","v":0},"1900-01-01","1900-01-01",0,"1900-01-01","1900-01-01",0,{"$f":"IF(Report1!J119=\"\",\"#N/A\",Report1!J119)","v":"#N/A"}]
[{"$f":"IF(Report1!D120=\"\",0,Report1!D120)","v":0},{"$f":"IF(Report1!E120=\"\",\"#N/A\",Report1!E120)","v":"#N/A"},{"$f":"IF(Report1!F120=\"\",\"#N/A\",Report1!F120)","v":"#N/A"},{"$f":"IF(Report1!G120=\"\",\"#N/A\",Report1!G120)","v":"#N/A"},{"$f":"IF(Report1!H120=\"\",DATE(1900,1,1),Report1!H120)","v":"1900-01-01"},{"$f":"IF(Report1!I120=\"\",0,Report1!I120)","v":0},"1900-01-01","1900-01-01",0,"1900-01-01","1900-01-01",0,{"$f":"IF(Report1!J120=\"\",\"#N/A\",Report1!J120)","v":"#N/A"}]
[{"$f":"IF(Report1!D121=\"\",0,Report1!D121)","v":0},{"$f":"IF(Report1!E121=\"\",\"#N/A\",Report1!E121)","v":"#N/A"},{"$f":"IF(Report1!F121=\"\",\"#N/A\",Report1!F121)","v":"#N/A"},{"$f":"IF(Report1!G121=\"\",\"#N/A\",Report1!G121)","v":"#N/A"},{"$f":"IF(Report1!H121=\"\",DATE(1900,1,1),Report1!H121)","v":"1900-01-01"},{"$f":"IF(Report1!I121=\"\",0,Report1!I121)","v":0},"1900-01-01","1900-01-01",0,"1900-01-01","1900-01-01",0,{"$f":"IF(Report1!J121=\"\",\"#N/A\",Report1!J121)","v":"#N/A"}]
[{"$f":"IF(Report1!D122=\"\",0,Report1!D122)","v":0},{"$f":"IF(Report1!E122=\"\",\"#N/A\",Report1!E122)","v":"#N/A"},{"$f":"IF(Report1!F122=\"\",\"#N/A\",Report1!F122)","v":"#N/A"},{"$f":"IF(Report1!G122=\"\",\"#N/A\",Report1!G122)","v":"#N/A"},{"$f":"IF(Report1!H122=\"\",DATE(1900,1,1),Report1!H122)","v":"1900-01-01"},{"$f":"IF(Report1!I122=\"\",0,Report1!I122)","v":0},"1900-01-01","1900-01-01",0,"1900-01-01","1900-01-01",0,{"$f":"IF(Report1!J122=\"\",\"#N/A\",Report1!J122)","v":"#N/A"}]
[{"$f":"IF(Report1!D123=\"\",0,Report1!D123)","v":0},{"$f":"IF(Report1!E123=\"\",\"#N/A\",Report1!E123)","v":"#N/A"},{"$f":"IF(Report1!F123=\"\",\"#N/A\",Report1!F123)","v":"#N/A"},{"$f":"IF(Report1!G123=\"\",\"#N/A\",Report1!G123)","v":"#N/A"},{"$f":"IF(Report1!H123=\"\",DATE(1900,1,1),Report1!H123)","v":"1900-01-01"},{"$f":"IF(Report1!I123=\"\",0,Report1!I123)","v":0},"1900-01-01","1900-01-01",0,"1900-01-01","1900-01-01",0,{"$f":"IF(Report1!J123=\"\",\"#N/A\",Report1!J123)","v":"#N/A"}]
[{"$f":"IF(Report1!D124=\"\",0,Report1!D124)","v":0},{"$f":"IF(Report1!E124=\"\",\"#N/A\",Report1!E124)","v":"#N/A"},{"$f":"IF(Report1!F124=\"\",\"#N/A\",Report1!F124)","v":"#N/A"},{"$f":"IF(Report1!G124=\"\",\"#N/A\",Report1!G124)","v":"#N/A"},{"$f":"IF(Report1!H124=\"\",DATE(1900,1,1),Report1!H124)","v":"1900-01-01"},{"$f":"IF(Report1!I124=\"\",0,Report1!I124)","v":0},"1900-01-01","1900-01-01",0,"1900-01-01","1900-01-01",0,{"$f":"IF(Report1!J124=\"\",\"#N/A\",Report1!J124)","v":"#N/A"}]
[{"$f":"IF(Report1!D125=\"\",0,Report1!D125)","v":0},{"$f":"IF(Report1!E125=\"\",\"#N/A\",Report1!E125)","v":"#N/A"},{"$f":"IF(Report1!F125=\"\",\"#N/A\",Report1!F125)","v":"#N/A"},{"$f":"IF(Report1!G125=\"\",\"#N/A\",Report1!G125)","v":"#N/A"},{"$f":"IF(Report1!H125=\"\",DATE(1900,1,1),Report1!H125)","v":"1900-01-01"},{"$f":"IF(Report1!I125=\"\",0,Report1!I125)","v":0},"1900-01-01","1900-01-01",0,"1900-01-01","1900-01-01",0,{"$f":"IF(Report1!J125=\"\",\"#N/A\",Report1!J125)","v":"#N/A"}]
[{"$f":"IF(Report1!D126=\"\",0,Report1!D126)","v":0},{"$f":"IF(Report1!E126=\"\",\"#N/A\",Report1!E126)","v":"#N/A"},{"$f":"IF(Report1!F126=\"\",\"#N/A\",Report1!F126)","v":"#N/A"},{"$f":"IF(Report1!G126=\"\",\"#N/A\",Report1!G126)","v":"#N/A"},{"$f":"IF(Report1!H126=\"\",DATE(1900,1,1),Report1!H126)","v":"1900-01-01"},{"$f":"IF(Report1!I126=\"\",0,Report1!I126)","v":0},"1900-01-01","1900-01-01",0,"1900-01-01","1900-01-01",0,{"$f":"IF(Report1!J126=\"\",\"#N/A\",Report1!J126)","v":"#N/A"}]
[{"$f":"IF(Report1!D127=\"\",0,Report1!D127)","v":0},{"$f":"IF(Report1!E127=\"\",\"#N/A\",Report1!E127)","v":"#N/A"},{"$f":"IF(Report1!F127=\"\",\"#N/A\",Report1!F127)","v":"#N/A"},{"$f":"IF(Report1!G127=\"\",\"#N/A\",Report1!G127)","v":"#N/A"},{"$f":"IF(Report1!H127=\"\",DATE(1900,1,1),Report1!H127)","v":"1900-01-01"},{"$f":"IF(Report1!I127=\"\",0,Report1!I127)","v":0},"1900-01-01","1900-01-01",0,"1900-01-01","1900-01-01",0,{"$f":"IF(Report1!J127=\"\",\"#N/A\",Report1!J127)","v":"#N/A"}]
[{"$f":"IF(Report1!D128=\"\",0,Report1!D128)","v":0},{"$f":"IF(Report1!E128=\"\",\"#N/A\",Report1!E128)","v":"#N/A"},{"$f":"IF(Report1!F128=\"\",\"#N/A\",Report1!F128)","v":"#N/A"},{"$f":"IF(Report1!G128=\"\",\"#N/A\",Report1!G128)","v":"#N/A"},{"$f":"IF(Report1!H128=\"\",DATE(1900,1,1),Report1!H128)","v":"1900-01-01"},{"$f":"IF(Report1!I128=\"\",0,Report1!I128)","v":0},"1900-01-01","1900-01-01",0,"1900-01-01","1900-01-01",0,{"$f":"IF(Report1!J128=\"\",\"#N/A\",Report1!J128)","v":"#N/A"}]
[{"$f":"IF(Report1!D129=\"\",0,Report1!D129)","v":0},{"$f":"IF(Report1!E129=\"\",\"#N/A\",Report1!E129)","v":"#N/A"},{"$f":"IF(Report1!F129=\"\",\"#N/A\",Report1!F129)","v":"#N/A"},{"$f":"IF(Report1!G129=\"\",\"#N/A\",Report1!G129)","v":"#N/A"},{"$f":"IF(Report1!H129=\"\",DATE(1900,1,1),Report1!H129)","v":"1900-01-01"},{"$f":"IF(Report1!I129=\"\",0,Report1!I129)","v":0},"1900-01-01","1900-01-01",0,"1900-01-01","1900-01-01",0,{"$f":"IF(Report1!J129=\"\",\"#N/A\",Report1!J129)","v":"#N/A"}]
[{"$f":"IF(Report1!D130=\"\",0,Report1!D130)","v":0},{"$f":"IF(Report1!E130=\"\",\"#N/A\",Report1!E130)","v":"#N/A"},{"$f":"IF(Report1!F130=\"\",\"#N/A\",Report1!F130)","v":"#N/A"},{"$f":"IF(Report1!G130=\"\",\"#N/A\",Report1!G130)","v":"#N/A"},{"$f":"IF(Report1!H130=\"\",DATE(1900,1,1),Report1!H130)","v":"1900-01-01"},{"$f":"IF(Report1!I130=\"\",0,Report1!I130)","v":0},"1900-01-01","1900-01-01",0,"1900-01-01","1900-01-01",0,{"$f":"IF(Report1!J130=\"\",\"#N/A\",Report1!J130)","v":"#N/A"}]
[{"$f":"IF(Report1!D131=\"\",0,Report1!D131)","v":0},{"$f":"IF(Report1!E131=\"\",\"#N/A\",Report1!E131)","v":"#N/A"},{"$f":"IF(Report1!F131=\"\",\"#N/A\",Report1!F131)","v":"#N/A"},{"$f":"IF(Report1!G131=\"\",\"#N/A\",Report1!G131)","v":"#N/A"},{"$f":"IF(Report1!H131=\"\",DATE(1900,1,1),Report1!H131)","v":"1900-01-01"},{"$f":"IF(Report1!I131=\"\",0,Report1!I131)","v":0},"1900-01-01","1900-01-01",0,"1900-01-01","1900-01-01",0,{"$f":"IF(Report1!J131=\"\",\"#N/A\",Report1!J131)","v":"#N/A"}]
[{"$f":"IF(Report1!D132=\"\",0,Report1!D132)","v":0},{"$f":"IF(Report1!E132=\"\",\"#N/A\",Report1!E132)","v":"#N/A"},{"$f":"IF(Report1!F132=\"\",\"#N/A\",Report1!F132)","v":"#N/A"},{"$f":"IF(Report1!G132=\"\",\"#N/A\",Report1!G132)","v":"#N/A"},{"$f":"IF(Report1!H132=\"\",DATE(1900,1,1),Report1!H132)","v":"1900-01-01"},{"$f":"IF(Report1!I132=\"\",0,Report1!I132)","v":0},"1900-01-01","1900-01-01",0,"1900-01-01","1900-01-01",0,{"$f":"IF(Report1!J132=\"\",\"#N/A\",Report1!J132)","v":"#N/A"}]
[{"$f":"IF(Report1!D133=\"\",0,Report1!D133)","v":0},{"$f":"IF(Report1!E133=\"\",\"#N/A\",Report1!E133)","v":"#N/A"},{"$f":"IF(Report1!F133=\"\",\"#N/A\",Report1!F133)","v":"#N/A"},{"$f":"IF(Report1!G133=\"\",\"#N/A\",Report1!G133)","v":"#N/A"},{"$f":"IF(Report1!H133=\"\",DATE(1900,1,1),Report1!H133)","v":"1900-01-01"},{"$f":"IF(Report1!I133=\"\",0,Report1!I133)","v":0},"1900-01-01","1900-01-01",0,"1900-01-01","1900-01-01",0,{"$f":"IF(Report1!J133=\"\",\"#N/A\",Report1!J133)","v":"#N/A"}]
[{"$f":"IF(Report1!D134=\"\",0,Report1!D134)","v":0},{"$f":"IF(Report1!E134=\"\",\"#N/A\",Report1!E134)","v":"#N/A"},{"$f":"IF(Report1!F134=\"\",\"#N/A\",Report1!F134)","v":"#N/A"},{"$f":"IF(Report1!G134=\"\",\"#N/A\",Report1!G134)","v":"#N/A"},{"$f":"IF(Report1!H134=\"\",DATE(1900,1,1),Report1!H134)","v":"1900-01-01"},{"$f":"IF(Report1!I134=\"\",0,Report1!I134)","v":0},"1900-01-01","1900-01-01",0,"1900-01-01","1900-01-01",0,{"$f":"IF(Report1!J134=\"\",\"#N/A\",Report1!J134)","v":"#N/A"}]
[{"$f":"IF(Report1!D135=\"\",0,Report1!D135)","v":0},{"$f":"IF(Report1!E135=\"\",\"#N/A\",Report1!E135)","v":"#N/A"},{"$f":"IF(Report1!F135=\"\",\"#N/A\",Report1!F135)","v":"#N/A"},{"$f":"IF(Report1!G135=\"\",\"#N/A\",Report1!G135)","v":"#N/A"},{"$f":"IF(Report1!H135=\"\",DATE(1900,1,1),Report1!H135)","v":"1900-01-01"},{"$f":"IF(Report1!I135=\"\",0,Report1!I135)","v":0},"1900-01-01","1900-01-01",0,"1900-01-01","1900-01-01",0,{"$f":"IF(Report1!J135=\"\",\"#N/A\",Report1!J135)","v":"#N/A"}]
[{"$f":"IF(Report1!D136=\"\",0,Report1!D136)","v":0},{"$f":"IF(Report1!E136=\"\",\"#N/A\",Report1!E136)","v":"#N/A"},{"$f":"IF(Report1!F136=\"\",\"#N/A\",Report1!F136)","v":"#N/A"},{"$f":"IF(Report1!G136=\"\",\"#N/A\",Report1!G136)","v":"#N/A"},{"$f":"IF(Report1!H136=\"\",DATE(1900,1,1),Report1!H136)","v":"1900-01-01"},{"$f":"IF(Report1!I136=\"\",0,Report1!I136)","v":0},"1900-01-01","1900-01-01",0,"1900-01-01","1900-01-01",0,{"$f":"IF(Report1!J136=\"\",\"#N/A\",Report1!J136)","v":"#N/A"}]
[{"$f":"IF(Report1!D137=\"\",0,Report1!D137)","v":0},{"$f":"IF(Report1!E137=\"\",\"#N/A\",Report1!E137)","v":"#N/A"},{"$f":"IF(Report1!F137=\"\",\"#N/A\",Report1!F137)","v":"#N/A"},{"$f":"IF(Report1!G137=\"\",\"#N/A\",Report1!G137)","v":"#N/A"},{"$f":"IF(Report1!H137=\"\",DATE(1900,1,1),Report1!H137)","v":"1900-01-01"},{"$f":"IF(Report1!I137=\"\",0,Report1!I137)","v":0},"1900-01-01","1900-01-01",0,"1900-01-01","1900-01-01",0,{"$f":"IF(Report1!J137=\"\",\"#N/A\",Report1!J137)","v":"#N/A"}]
[{"$f":"IF(Report1!D138=\"\",0,Report1!D138)","v":0},{"$f":"IF(Report1!E138=\"\",\"#N/A\",Report1!E138)","v":"#N/A"},{"$f":"IF(Report1!F138=\"\",\"#N/A\",Report1!F138)","v":"#N/A"},{"$f":"IF(Report1!G138=\"\",\"#N/A\",Report1!G138)","v":"#N/A"},{"$f":"IF(Report1!H138=\"\",DATE(1900,1,1),Report1!H138)","v":"1900-01-01"},{"$f":"IF(Report1!I138=\"\",0,Report1!I138)","v":0},"1900-01-01","1900-01-01",0,"1900-01-01","1900-01-01",0,{"$f":"IF(Report1!J138=\"\",\"#N/A\",Report1!J138)","v":"#N/A"}]
[{"$f":"IF(Report1!D139=\"\",0,Report1!D139)","v":0},{"$f":"IF(Report1!E139=\"\",\"#N/A\",Report1!E139)","v":"#N/A"},{"$f":"IF(Report1!F139=\"\",\"#N/A\",Report1!F139)","v":"#N/A"},{"$f":"IF(Report1!G139=\"\",\"#N/A\",Report1!G139)","v":"#N/A"},{"$f":"IF(Report1!H139=\"\",DATE(1900,1,1),Report1!H139)","v":"1900-01-01"},{"$f":"IF(Report1!I139=\"\",0,Report1!I139)","v":0},"1900-01-01","1900-01-01",0,"1900-01-01","1900-01-01",0,{"$f":"IF(Report1!J139=\"\",\"#N/A\",Report1!J139)","v":"#N/A"}]
[{"$f":"IF(Report1!D140=\"\",0,Report1!D140)","v":0},{"$f":"IF(Report1!E140=\"\",\"#N/A\",Report1!E140)","v":"#N/A"},{"$f":"IF(Report1!F140=\"\",\"#N/A\",Report1!F140)","v":"#N/A"},{"$f":"IF(Report1!G140=\"\",\"#N/A\",Report1!G140)","v":"#N/A"},{"$f":"IF(Report1!H140=\"\",DATE(1900,1,1),Report1!H140)","v":"1900-01-01"},{"$f":"IF(Report1!I140=\"\",0,Report1!I140)","v":0},"1900-01-01","1900-01-01",0,"1900-01-01","1900-01-01",0,{"$f":"IF(Report1!J140=\"\",\"#N/A\",Report1!J140)","v":"#N/A"}]
[{"$f":"IF(Report1!D141=\"\",0,Report1!D141)","v":0},{"$f":"IF(Report1!E141=\"\",\"#N/A\",Report1!E141)","v":"#N/A"},{"$f":"IF(Report1!F141=\"\",\"#N/A\",Report1!F141)","v":"#N/A"},{"$f":"IF(Report1!G141=\"\",\"#N/A\",Report1!G141)","v":"#N/A"},{"$f":"IF(Report1!H141=\"\",DATE(1900,1,1),Report1!H141)","v":"1900-01-01"},{"$f":"IF(Report1!I141=\"\",0,Report1!I141)","v":0},"1900-01-01","1900-01-01",0,"1900-01-01","1900-01-01",0,{"$f":"IF(Report1!J141=\"\",\"#N/A\",Report1!J141)","v":"#N/A"}]
[{"$f":"IF(Report1!D142=\"\",0,Report1!D142)","v":0},{"$f":"IF(Report1!E142=\"\",\"#N/A\",Report1!E142)","v":"#N/A"},{"$f":"IF(Report1!F142=\"\",\"#N/A\",Report1!F142)","v":"#N/A"},{"$f":"IF(Report1!G142=\"\",\"#N/A\",Report1!G142)","v":"#N/A"},{"$f":"IF(Report1!H142=\"\",DATE(1900,1,1),Report1!H142)","v":"1900-01-01"},{"$f":"IF(Report1!I142=\"\",0,Report1!I142)","v":0},{"$f":"DATE(1900,1,1)","v":"1900-01-01"},"1900-01-01",0,{"$f":"DATE(1900,1,1)","v":"1900-01-01"},"1900-01-01",0,{"$f":"IF(Report1!J142=\"\",\"#N/A\",Report1!J142)","v":"#N/A"}]
[{"$f":"IF(Report1!D143=\"\",0,Report1!D143)","v":0},{"$f":"IF(Report1!E143=\"\",\"#N/A\",Report1!E143)","v":"#N/A"},{"$f":"IF(Report1!F143=\"\",\"#N/A\",Report1!F143)","v":"#N/A"},{"$f":"IF(Report1!G143=\"\",\"#N/A\",Report1!G143)","v":"#N/A"},{"$f":"IF(Report1!H143=\"\",DATE(1900,1,1),Report1!H143)","v":"1900-01-01"},{"$f":"IF(Report1!I143=\"\",0,Report1!I143)","v":0},"1900-01-01","1900-01-01",0,"1900-01-01","1900-01-01",0,{"$f":"IF(Report1!J143=\"\",\"#N/A\",Report1!J143)","v":"#N/A"}]
[{"$f":"IF(Report1!D144=\"\",0,Report1!D144)","v":0},{"$f":"IF(Report1!E144=\"\",\"#N/A\",Report1!E144)","v":"#N/A"},{"$f":"IF(Report1!F144=\"\",\"#N/A\",Report1!F144)","v":"#N/A"},{"$f":"IF(Report1!G144=\"\",\"#N/A\",Report1!G144)","v":"#N/A"},{"$f":"IF(Report1!H144=\"\",DATE(1900,1,1),Report1!H144)","v":"1900-01-01"},{"$f":"IF(Report1!I144=\"\",0,Report1!I144)","v":0},"1900-01-01","1900-01-01",0,"1900-01-01","1900-01-01",0,{"$f":"IF(Report1!J144=\"\",\"#N/A\",Report1!J144)","v":"#N/A"}]
[{"$f":"IF(Report1!D145=\"\",0,Report1!D145)","v":0},{"$f":"IF(Report1!E145=\"\",\"#N/A\",Report1!E145)","v":"#N/A"},{"$f":"IF(Report1!F145=\"\",\"#N/A\",Report1!F145)","v":"#N/A"},{"$f":"IF(Report1!G145=\"\",\"#N/A\",Report1!G145)","v":"#N/A"},{"$f":"IF(Report1!H145=\"\",DATE(1900,1,1),Report1!H145)","v":"1900-01-01"},{"$f":"IF(Report1!I145=\"\",0,Report1!I145)","v":0},"1900-01-01","1900-01-01",0,"1900-01-01","1900-01-01",0,{"$f":"IF(Report1!J145=\"\",\"#N/A\",Report1!J145)","v":"#N/A"}]
[{"$f":"IF(Report1!D146=\"\",0,Report1!D146)","v":0},{"$f":"IF(Report1!E146=\"\",\"#N/A\",Report1!E146)","v":"#N/A"},{"$f":"IF(Report1!F146=\"\",\"#N/A\",Report1!F146)","v":"#N/A"},{"$f":"IF(Report1!G146=\"\",\"#N/A\",Report1!G146)","v":"#N/A"},{"$f":"IF(Report1!H146=\"\",DATE(1900,1,1),Report1!H146)","v":"1900-01-01"},{"$f":"IF(Report1!I146=\"\",0,Report1!I146)","v":0},"1900-01-01","1900-01-01",0,"1900-01-01","1900-01-01",0,{"$f":"IF(Report1!J146=\"\",\"#N/A\",Report1!J146)","v":"#N/A"}]
[{"$f":"IF(Report1!D147=\"\",0,Report1!D147)","v":0},{"$f":"IF(Report1!E147=\"\",\"#N/A\",Report1!E147)","v":"#N/A"},{"$f":"IF(Report1!F147=\"\",\"#N/A\",Report1!F147)","v":"#N/A"},{"$f":"IF(Report1!G147=\"\",\"#N/A\",Report1!G147)","v":"#N/A"},{"$f":"IF(Report1!H147=\"\",DATE(1900,1,1),Report1!H147)","v":"1900-01-01"},{"$f":"IF(Report1!I147=\"\",0,Report1!I147)","v":0},"1900-01-01","1900-01-01",0,"1900-01-01","1900-01-01",0,{"$f":"IF(Report1!J147=\"\",\"#N/A\",Report1!J147)","v":"#N/A"}]
[{"$f":"IF(Report1!D148=\"\",0,Report1!D148)","v":0},{"$f":"IF(Report1!E148=\"\",\"#N/A\",Report1!E148)","v":"#N/A"},{"$f":"IF(Report1!F148=\"\",\"#N/A\",Report1!F148)","v":"#N/A"},{"$f":"IF(Report1!G148=\"\",\"#N/A\",Report1!G148)","v":"#N/A"},{"$f":"IF(Report1!H148=\"\",DATE(1900,1,1),Report1!H148)","v":"1900-01-01"},{"$f":"IF(Report1!I148=\"\",0,Report1!I148)","v":0},"1900-01-01","1900-01-01",0,"1900-01-01","1900-01-01",0,{"$f":"IF(Report1!J148=\"\",\"#N/A\",Report1!J148)","v":"#N/A"}]
[{"$f":"IF(Report1!D149=\"\",0,Report1!D149)","v":0},{"$f":"IF(Report1!E149=\"\",\"#N/A\",Report1!E149)","v":"#N/A"},{"$f":"IF(Report1!F149=\"\",\"#N/A\",Report1!F149)","v":"#N/A"},{"$f":"IF(Report1!G149=\"\",\"#N/A\",Report1!G149)","v":"#N/A"},{"$f":"IF(Report1!H149=\"\",DATE(1900,1,1),Report1!H149)","v":"1900-01-01"},{"$f":"IF(Report1!I149=\"\",0,Report1!I149)","v":0},"1900-01-01","1900-01-01",0,"1900-01-01","1900-01-01",0,{"$f":"IF(Report1!J149=\"\",\"#N/A\",Report1!J149)","v":"#N/A"}]
[{"$f":"IF(Report1!D150=\"\",0,Report1!D150)","v":0},{"$f":"IF(Report1!E150=\"\",\"#N/A\",Report1!E150)","v":"#N/A"},{"$f":"IF(Report1!F150=\"\",\"#N/A\",Report1!F150)","v":"#N/A"},{"$f":"IF(Report1!G150=\"\",\"#N/A\",Report1!G150)","v":"#N/A"},{"$f":"IF(Report1!H150=\"\",DATE(1900,1,1),Report1!H150)","v":"1900-01-01"},{"$f":"IF(Report1!I150=\"\",0,Report1!I150)","v":0},"1900-01-01","1900-01-01",0,"1900-01-01","1900-01-01",0,{"$f":"IF(Report1!J150=\"\",\"#N/A\",Report1!J150)","v":"#N/A"}]
[{"$f":"IF(Report1!D151=\"\",0,Report1!D151)","v":0},{"$f":"IF(Report1!E151=\"\",\"#N/A\",Report1!E151)","v":"#N/A"},{"$f":"IF(Report1!F151=\"\",\"#N/A\",Report1!F151)","v":"#N/A"},{"$f":"IF(Report1!G151=\"\",\"#N/A\",Report1!G151)","v":"#N/A"},{"$f":"IF(Report1!H151=\"\",DATE(1900,1,1),Report1!H151)","v":"1900-01-01"},{"$f":"IF(Report1!I151=\"\",0,Report1!I151)","v":0},"1900-01-01","1900-01-01",0,"1900-01-01","1900-01-01",0,{"$f":"IF(Report1!J151=\"\",\"#N/A\",Report1!J151)","v":"#N/A"}]
[{"$f":"IF(Report1!D152=\"\",0,Report1!D152)","v":0},{"$f":"IF(Report1!E152=\"\",\"#N/A\",Report1!E152)","v":"#N/A"},{"$f":"IF(Report1!F152=\"\",\"#N/A\",Report1!F152)","v":"#N/A"},{"$f":"IF(Report1!G152=\"\",\"#N/A\",Report1!G152)","v":"#N/A"},{"$f":"IF(Report1!H152=\"\",DATE(1900,1,1),Report1!H152)","v":"1900-01-01"},{"$f":"IF(Report1!I152=\"\",0,Report1!I152)","v":0},"1900-01-01","1900-01-01",0,"1900-01-01","1900-01-01",0,{"$f":"IF(Report1!J152=\"\",\"#N/A\",Report1!J152)","v":"#N/A"}]
[{"$f":"IF(Report1!D153=\"\",0,Report1!D153)","v":0},{"$f":"IF(Report1!E153=\"\",\"#N/A\",Report1!E153)","v":"#N/A"},{"$f":"IF(Report1!F153=\"\",\"#N/A\",Report1!F153)","v":"#N/A"},{"$f":"IF(Report1!G153=\"\",\"#N/A\",Report1!G153)","v":"#N/A"},{"$f":"IF(Report1!H153=\"\",DATE(1900,1,1),Report1!H153)","v":"1900-01-01"},{"$f":"IF(Report1!I153=\"\",0,Report1!I153)","v":0},"1900-01-01","1900-01-01",0,"1900-01-01","1900-01-01",0,{"$f":"IF(Report1!J153=\"\",\"#N/A\",Report1!J153)","v":"#N/A"}]
[{"$f":"IF(Report1!D154=\"\",0,Report1!D154)","v":0},{"$f":"IF(Report1!E154=\"\",\"#N/A\",Report1!E154)","v":"#N/A"},{"$f":"IF(Report1!F154=\"\",\"#N/A\",Report1!F154)","v":"#N/A"},{"$f":"IF(Report1!G154=\"\",\"#N/A\",Report1!G154)","v":"#N/A"},{"$f":"IF(Report1!H154=\"\",DATE(1900,1,1),Report1!H154)","v":"1900-01-01"},{"$f":"IF(Report1!I154=\"\",0,Report1!I154)","v":0},"1900-01-01","1900-01-01",0,"1900-01-01","1900-01-01",0,{"$f":"IF(Report1!J154=\"\",\"#N/A\",Report1!J154)","v":"#N/A"}]
[{"$f":"IF(Report1!D155=\"\",0,Report1!D155)","v":0},{"$f":"IF(Report1!E155=\"\",\"#N/A\",Report1!E155)","v":"#N/A"},{"$f":"IF(Report1!F155=\"\",\"#N/A\",Report1!F155)","v":"#N/A"},{"$f":"IF(Report1!G155=\"\",\"#N/A\",Report1!G155)","v":"#N/A"},{"$f":"IF(Report1!H155=\"\",DATE(1900,1,1),Report1!H155)","v":"1900-01-01"},{"$f":"IF(Report1!I155=\"\",0,Report1!I155)","v":0},"1900-01-01","1900-01-01",0,"1900-01-01","1900-01-01",0,{"$f":"IF(Report1!J155=\"\",\"#N/A\",Report1!J155)","v":"#N/A"}]
[{"$f":"IF(Report1!D156=\"\",0,Report1!D156)","v":0},{"$f":"IF(Report1!E156=\"\",\"#N/A\",Report1!E156)","v":"#N/A"},{"$f":"IF(Report1!F156=\"\",\"#N/A\",Report1!F156)","v":"#N/A"},{"$f":"IF(Report1!G156=\"\",\"#N/A\",Report1!G156)","v":"#N/A"},{"$f":"IF(Report1!H156=\"\",DATE(1900,1,1),Report1!H156)","v":"1900-01-01"},{"$f":"IF(Report1!I156=\"\",0,Report1!I156)","v":0},"1900-01-01","1900-01-01",0,"1900-01-01","1900-01-01",0,{"$f":"IF(Report1!J156=\"\",\"#N/A\",Report1!J156)","v":"#N/A"}]
[{"$f":"IF(Report1!D157=\"\",0,Report1!D157)","v":0},{"$f":"IF(Report1!E157=\"\",\"#N/A\",Report1!E157)","v":"#N/A"},{"$f":"IF(Report1!F157=\"\",\"#N/A\",Report1!F157)","v":"#N/A"},{"$f":"IF(Report1!G157=\"\",\"#N/A\",Report1!G157)","v":"#N/A"},{"$f":"IF(Report1!H157=\"\",DATE(1900,1,1),Report1!H157)","v":"1900-01-01"},{"$f":"IF(Report1!I157=\"\",0,Report1!I157)","v":0},"1900-01-01","1900-01-01",0,"1900-01-01","1900-01-01",0,{"$f":"IF(Report1!J157=\"\",\"#N/A\",Report1!J157)","v":"#N/A"}]
[{"$f":"IF(Report1!D158=\"\",0,Report1!D158)","v":0},{"$f":"IF(Report1!E158=\"\",\"#N/A\",Report1!E158)","v":"#N/A"},{"$f":"IF(Report1!F158=\"\",\"#N/A\",Report1!F158)","v":"#N/A"},{"$f":"IF(Report1!G158=\"\",\"#N/A\",Report1!G158)","v":"#N/A"},{"$f":"IF(Report1!H158=\"\",DATE(1900,1,1),Report1!H158)","v":"1900-01-01"},{"$f":"IF(Report1!I158=\"\",0,Report1!I158)","v":0},"1900-01-01","1900-01-01",0,"1900-01-01","1900-01-01",0,{"$f":"IF(Report1!J158=\"\",\"#N/A\",Report1!J158)","v":"#N/A"}]
[{"$f":"IF(Report1!D159=\"\",0,Report1!D159)","v":0},{"$f":"IF(Report1!E159=\"\",\"#N/A\",Report1!E159)","v":"#N/A"},{"$f":"IF(Report1!F159=\"\",\"#N/A\",Report1!F159)","v":"#N/A"},{"$f":"IF(Report1!G159=\"\",\"#N/A\",Report1!G159)","v":"#N/A"},{"$f":"IF(Report1!H159=\"\",DATE(1900,1,1),Report1!H159)","v":"1900-01-01"},{"$f":"IF(Report1!I159=\"\",0,Report1!I159)","v":0},"1900-01-01","1900-01-01",0,"1900-01-01","1900-01-01",0,{"$f":"IF(Report1!J159=\"\",\"#N/A\",Report1!J159)","v":"#N/A"}]
[{"$f":"IF(Report1!D160=\"\",0,Report1!D160)","v":0},{"$f":"IF(Report1!E160=\"\",\"#N/A\",Report1!E160)","v":"#N/A"},{"$f":"IF(Report1!F160=\"\",\"#N/A\",Report1!F160)","v":"#N/A"},{"$f":"IF(Report1!G160=\"\",\"#N/A\",Report1!G160)","v":"#N/A"},{"$f":"IF(Report1!H160=\"\",DATE(1900,1,1),Report1!H160)","v":"1900-01-01"},{"$f":"IF(Report1!I160=\"\",0,Report1!I160)","v":0},"1900-01-01","1900-01-01",0,"1900-01-01","1900-01-01",0,{"$f":"IF(Report1!J160=\"\",\"#N/A\",Report1!J160)","v":"#N/A"}]
[{"$f":"IF(Report1!D161=\"\",0,Report1!D161)","v":0},{"$f":"IF(Report1!E161=\"\",\"#N/A\",Report1!E161)","v":"#N/A"},{"$f":"IF(Report1!F161=\"\",\"#N/A\",Report1!F161)","v":"#N/A"},{"$f":"IF(Report1!G161=\"\",\"#N/A\",Report1!G161)","v":"#N/A"},{"$f":"IF(Report1!H161=\"\",DATE(1900,1,1),Report1!H161)","v":"1900-01-01"},{"$f":"IF(Report1!I161=\"\",0,Report1!I161)","v":0},"1900-01-01","1900-01-01",0,"1900-01-01","1900-01-01",0,{"$f":"IF(Report1!J161=\"\",\"#N/A\",Report1!J161)","v":"#N/A"}]
[{"$f":"IF(Report1!D162=\"\",0,Report1!D162)","v":0},{"$f":"IF(Report1!E162=\"\",\"#N/A\",Report1!E162)","v":"#N/A"},{"$f":"IF(Report1!F162=\"\",\"#N/A\",Report1!F162)","v":"#N/A"},{"$f":"IF(Report1!G162=\"\",\"#N/A\",Report1!G162)","v":"#N/A"},{"$f":"IF(Report1!H162=\"\",DATE(1900,1,1),Report1!H162)","v":"1900-01-01"},{"$f":"IF(Report1!I162=\"\",0,Report1!I162)","v":0},"1900-01-01","1900-01-01",0,"1900-01-01","1900-01-01",0,{"$f":"IF(Report1!J162=\"\",\"#N/A\",Report1!J162)","v":"#N/A"}]
[{"$f":"IF(Report2!D13=\"\",0,Report2!D13)","v":0},{"$f":"IF(Report2!E13=\"\",\"#N/A\",Report2!E13)","v":"#N/A"},{"$f":"IF(Report2!F13=\"\",\"#N/A\",Report2!F13)","v":"#N/A"},{"$f":"IF(Report2!G13=\"\",\"#N/A\",Report2!G13)","v":"#N/A"},{"$f":"IF(Report2!H13=\"\",DATE(1900,1,1),Report2!H13)","v":"1900-01-01"},{"$f":"IF(Report2!I13=\"\",0,Report2!I13)","v":0},"1900-01-01","1900-01-01",0,"1900-01-01","1900-01-01",0,{"$f":"IF(Report2!J13=\"\",\"#N/A\",Report2!J13)","v":"#N/A"}]
[{"$f":"IF(Report2!D14=\"\",0,Report2!D14)","v":0},{"$f":"IF(Report2!E14=\"\",\"#N/A\",Report2!E14)","v":"#N/A"},{"$f":"IF(Report2!F14=\"\",\"#N/A\",Report2!F14)","v":"#N/A"},{"$f":"IF(Report2!G14=\"\",\"#N/A\",Report2!G14)","v":"#N/A"},{"$f":"IF(Report2!H14=\"\",DATE(1900,1,1),Report2!H14)","v":"1900-01-01"},{"$f":"IF(Report2!I14=\"\",0,Report2!I14)","v":0},"1900-01-01","1900-01-01",0,"1900-01-01","1900-01-01",0,{"$f":"IF(Report2!J14=\"\",\"#N/A\",Report2!J14)","v":"#N/A"}]
[{"$f":"IF(Report2!D15=\"\",0,Report2!D15)","v":0},{"$f":"IF(Report2!E15=\"\",\"#N/A\",Report2!E15)","v":"#N/A"},{"$f":"IF(Report2!F15=\"\",\"#N/A\",Report2!F15)","v":"#N/A"},{"$f":"IF(Report2!G15=\"\",\"#N/A\",Report2!G15)","v":"#N/A"},{"$f":"IF(Report2!H15=\"\",DATE(1900,1,1),Report2!H15)","v":"1900-01-01"},{"$f":"IF(Report2!I15=\"\",0,Report2!I15)","v":0},"1900-01-01","1900-01-01",0,"1900-01-01","1900-01-01",0,{"$f":"IF(Report2!J15=\"\",\"#N/A\",Report2!J15)","v":"#N/A"}]
[{"$f":"IF(Report2!D16=\"\",0,Report2!D16)","v":0},{"$f":"IF(Report2!E16=\"\",\"#N/A\",Report2!E16)","v":"#N/A"},{"$f":"IF(Report2!F16=\"\",\"#N/A\",Report2!F16)","v":"#N/A"},{"$f":"IF(Report2!G16=\"\",\"#N/A\",Report2!G16)","v":"#N/A"},{"$f":"IF(Report2!H16=\"\",DATE(1900,1,1),Report2!H16)","v":"1900-01-01"},{"$f":"IF(Report2!I16=\"\",0,Report2!I16)","v":0},"1900-01-01","1900-01-01",0,"1900-01-01","1900-01-01",0,{"$f":"IF(Report2!J16=\"\",\"#N/A\",Report2!J16)","v":"#N/A"}]
[{"$f":"IF(Report2!D17=\"\",0,Report2!D17)","v":0},{"$f":"IF(Report2!E17=\"\",\"#N/A\",Report2!E17)","v":"#N/A"},{"$f":"IF(Report2!F17=\"\",\"#N/A\",Report2!F17)","v":"#N/A"},{"$f":"IF(Report2!G17=\"\",\"#N/A\",Report2!G17)","v":"#N/A"},{"$f":"IF(Report2!H17=\"\",DATE(1900,1,1),Report2!H17)","v":"1900-01-01"},{"$f":"IF(Report2!I17=\"\",0,Report2!I17)","v":0},"1900-01-01","1900-01-01",0,"1900-01-01","1900-01-01",0,{"$f":"IF(Report2!J17=\"\",\"#N/A\",Report2!J17)","v":"#N/A"}]
[{"$f":"IF(Report2!D18=\"\",0,Report2!D18)","v":0},{"$f":"IF(Report2!E18=\"\",\"#N/A\",Report2!E18)","v":"#N/A"},{"$f":"IF(Report2!F18=\"\",\"#N/A\",Report2!F18)","v":"#N/A"},{"$f":"IF(Report2!G18=\"\",\"#N/A\",Report2!G18)","v":"#N/A"},{"$f":"IF(Report2!H18=\"\",DATE(1900,1,1),Report2!H18)","v":"1900-01-01"},{"$f":"IF(Report2!I18=\"\",0,Report2!I18)","v":0},"1900-01-01","1900-01-01",0,"1900-01-01","1900-01-01",0,{"$f":"IF(Report2!J18=\"\",\"#N/A\",Report2!J18)","v":"#N/A"}]
[{"$f":"IF(Report2!D19=\"\",0,Report2!D19)","v":0},{"$f":"IF(Report2!E19=\"\",\"#N/A\",Report2!E19)","v":"#N/A"},{"$f":"IF(Report2!F19=\"\",\"#N/A\",Report2!F19)","v":"#N/A"},{"$f":"IF(Report2!G19=\"\",\"#N/A\",Report2!G19)","v":"#N/A"},{"$f":"IF(Report2!H19=\"\",DATE(1900,1,1),Report2!H19)","v":"1900-01-01"},{"$f":"IF(Report2!I19=\"\",0,Report2!I19)","v":0},"1900-01-01","1900-01-01",0,"1900-01-01","1900-01-01",0,{"$f":"IF(Report2!J19=\"\",\"#N/A\",Report2!J19)","v":"#N/A"}]
[{"$f":"IF(Report2!D20=\"\",0,Report2!D20)","v":0},{"$f":"IF(Report2!E20=\"\",\"#N/A\",Report2!E20)","v":"#N/A"},{"$f":"IF(Report2!F20=\"\",\"#N/A\",Report2!F20)","v":"#N/A"},{"$f":"IF(Report2!G20=\"\",\"#N/A\",Report2!G20)","v":"#N/A"},{"$f":"IF(Report2!H20=\"\",DATE(1900,1,1),Report2!H20)","v":"1900-01-01"},{"$f":"IF(Report2!I20=\"\",0,Report2!I20)","v":0},"1900-01-01","1900-01-01",0,"1900-01-01","1900-01-01",0,{"$f":"IF(Report2!J20=\"\",\"#N/A\",Report2!J20)","v":"#N/A"}]
[{"$f":"IF(Report2!D21=\"\",0,Report2!D21)","v":0},{"$f":"IF(Report2!E21=\"\",\"#N/A\",Report2!E21)","v":"#N/A"},{"$f":"IF(Report2!F21=\"\",\"#N/A\",Report2!F21)","v":"#N/A"},{"$f":"IF(Report2!G21=\"\",\"#N/A\",Report2!G21)","v":"#N/A"},{"$f":"IF(Report2!H21=\"\",DATE(1900,1,1),Report2!H21)","v":"1900-01-01"},{"$f":"IF(Report2!I21=\"\",0,Report2!I21)","v":0},"1900-01-01","1900-01-01",0,"1900-01-01","1900-01-01",0,{"$f":"IF(Report2!J21=\"\",\"#N/A\",Report2!J21)","v":"#N/A"}]
[{"$f":"IF(Report2!D22=\"\",0,Report2!D22)","v":0},{"$f":"IF(Report2!E22=\"\",\"#N/A\",Report2!E22)","v":"#N/A"},{"$f":"IF(Report2!F22=\"\",\"#N/A\",Report2!F22)","v":"#N/A"},{"$f":"IF(Report2!G22=\"\",\"#N/A\",Report2!G22)","v":"#N/A"},{"$f":"IF(Report2!H22=\"\",DATE(1900,1,1),Report2!H22)","v":"1900-01-01"},{"$f":"IF(Report2!I22=\"\",0,Report2!I22)","v":0},"1900-01-01","1900-01-01",0,"1900-01-01","1900-01-01",0,{"$f":"IF(Report2!J22=\"\",\"#N/A\",Report2!J22)","v":"#N/A"}]
[{"$f":"IF(Report2!D23=\"\",0,Report2!D23)","v":0},{"$f":"IF(Report2!E23=\"\",\"#N/A\",Report2!E23)","v":"#N/A"},{"$f":"IF(Report2!F23=\"\",\"#N/A\",Report2!F23)","v":"#N/A"},{"$f":"IF(Report2!G23=\"\",\"#N/A\",Report2!G23)","v":"#N/A"},{"$f":"IF(Report2!H23=\"\",DATE(1900,1,1),Report2!H23)","v":"1900-01-01"},{"$f":"IF(Report2!I23=\"\",0,Report2!I23)","v":0},"1900-01-01","1900-01-01",0,"1900-01-01","1900-01-01",0,{"$f":"IF(Report2!J23=\"\",\"#N/A\",Report2!J23)","v":"#N/A"}]
[{"$f":"IF(Report2!D24=\"\",0,Report2!D24)","v":0},{"$f":"IF(Report2!E24=\"\",\"#N/A\",Report2!E24)","v":"#N/A"},{"$f":"IF(Report2!F24=\"\",\"#N/A\",Report2!F24)","v":"#N/A"},{"$f":"IF(Report2!G24=\"\",\"#N/A\",Report2!G24)","v":"#N/A"},{"$f":"IF(Report2!H24=\"\",DATE(1900,1,1),Report2!H24)","v":"1900-01-01"},{"$f":"IF(Report2!I24=\"\",0,Report2!I24)","v":0},"1900-01-01","1900-01-01",0,{"$f":"DATE(1900,1,1)","v":"1900-01-01"},"1900-01-01",0,{"$f":"IF(Report2!J24=\"\",\"#N/A\",Report2!J24)","v":"#N/A"}]
[{"$f":"IF(Report2!D25=\"\",0,Report2!D25)","v":0},{"$f":"IF(Report2!E25=\"\",\"#N/A\",Report2!E25)","v":"#N/A"},{"$f":"IF(Report2!F25=\"\",\"#N/A\",Report2!F25)","v":"#N/A"},{"$f":"IF(Report2!G25=\"\",\"#N/A\",Report2!G25)","v":"#N/A"},{"$f":"IF(Report2!H25=\"\",DATE(1900,1,1),Report2!H25)","v":"1900-01-01"},{"$f":"IF(Report2!I25=\"\",0,Report2!I25)","v":0},"1900-01-01","1900-01-01",0,"1900-01-01","1900-01-01",0,{"$f":"IF(Report2!J25=\"\",\"#N/A\",Report2!J25)","v":"#N/A"}]
[{"$f":"IF(Report2!D26=\"\",0,Report2!D26)","v":0},{"$f":"IF(Report2!E26=\"\",\"#N/A\",Report2!E26)","v":"#N/A"},{"$f":"IF(Report2!F26=\"\",\"#N/A\",Report2!F26)","v":"#N/A"},{"$f":"IF(Report2!G26=\"\",\"#N/A\",Report2!G26)","v":"#N/A"},{"$f":"IF(Report2!H26=\"\",DATE(1900,1,1),Report2!H26)","v":"1900-01-01"},{"$f":"IF(Report2!I26=\"\",0,Report2!I26)","v":0},"1900-01-01","1900-01-01",0,"1900-01-01","1900-01-01",0,{"$f":"IF(Report2!J26=\"\",\"#N/A\",Report2!J26)","v":"#N/A"}]
[{"$f":"IF(Report2!D27=\"\",0,Report2!D27)","v":0},{"$f":"IF(Report2!E27=\"\",\"#N/A\",Report2!E27)","v":"#N/A"},{"$f":"IF(Report2!F27=\"\",\"#N/A\",Report2!F27)","v":"#N/A"},{"$f":"IF(Report2!G27=\"\",\"#N/A\",Report2!G27)","v":"#N/A"},{"$f":"IF(Report2!H27=\"\",DATE(1900,1,1),Report2!H27)","v":"1900-01-01"},{"$f":"IF(Report2!I27=\"\",0,Report2!I27)","v":0},"1900-01-01","1900-01-01",0,"1900-01-01","1900-01-01",0,{"$f":"IF(Report2!J27=\"\",\"#N/A\",Report2!J27)","v":"#N/A"}]
[{"$f":"IF(Report2!D28=\"\",0,Report2!D28)","v":0},{"$f":"IF(Report2!E28=\"\",\"#N/A\",Report2!E28)","v":"#N/A"},{"$f":"IF(Report2!F28=\"\",\"#N/A\",Report2!F28)","v":"#N/A"},{"$f":"IF(Report2!G28=\"\",\"#N/A\",Report2!G28)","v":"#N/A"},{"$f":"IF(Report2!H28=\"\",DATE(1900,1,1),Report2!H28)","v":"1900-01-01"},{"$f":"IF(Report2!I28=\"\",0,Report2!I28)","v":0},"1900-01-01","1900-01-01",0,"1900-01-01","1900-01-01",0,{"$f":"IF(Report2!J28=\"\",\"#N/A\",Report2!J28)","v":"#N/A"}]
[{"$f":"IF(Report2!D29=\"\",0,Report2!D29)","v":0},{"$f":"IF(Report2!E29=\"\",\"#N/A\",Report2!E29)","v":"#N/A"},{"$f":"IF(Report2!F29=\"\",\"#N/A\",Report2!F29)","v":"#N/A"},{"$f":"IF(Report2!G29=\"\",\"#N/A\",Report2!G29)","v":"#N/A"},{"$f":"IF(Report2!H29=\"\",DATE(1900,1,1),Report2!H29)","v":"1900-01-01"},{"$f":"IF(Report2!I29=\"\",0,Report2!I29)","v":0},"1900-01-01","1900-01-01",0,"1900-01-01","1900-01-01",0,{"$f":"IF(Report2!J29=\"\",\"#N/A\",Report2!J29)","v":"#N/A"}]
[{"$f":"IF(Report2!D30=\"\",0,Report2!D30)","v":0},{"$f":"IF(Report2!E30=\"\",\"#N/A\",Report2!E30)","v":"#N/A"},{"$f":"IF(Report2!F30=\"\",\"#N/A\",Report2!F30)","v":"#N/A"},{"$f":"IF(Report2!G30=\"\",\"#N/A\",Report2!G30)","v":"#N/A"},{"$f":"IF(Report2!H30=\"\",DATE(1900,1,1),Report2!H30)","v":"1900-01-01"},{"$f":"IF(Report2!I30=\"\",0,Report2!I30)","v":0},"1900-01-01","1900-01-01",0,"1900-01-01","1900-01-01",0,{"$f":"IF(Report2!J30=\"\",\"#N/A\",Report2!J30)","v":"#N/A"}]
[{"$f":"IF(Report2!D31=\"\",0,Report2!D31)","v":0},{"$f":"IF(Report2!E31=\"\",\"#N/A\",Report2!E31)","v":"#N/A"},{"$f":"IF(Report2!F31=\"\",\"#N/A\",Report2!F31)","v":"#N/A"},{"$f":"IF(Report2!G31=\"\",\"#N/A\",Report2!G31)","v":"#N/A"},{"$f":"IF(Report2!H31=\"\",DATE(1900,1,1),Report2!H31)","v":"1900-01-01"},{"$f":"IF(Report2!I31=\"\",0,Report2!I31)","v":0},"1900-01-01","1900-01-01",0,"1900-01-01","1900-01-01",0,{"$f":"IF(Report2!J31=\"\",\"#N/A\",Report2!J31)","v":"#N/A"}]
[{"$f":"IF(Report2!D32=\"\",0,Report2!D32)","v":0},{"$f":"IF(Report2!E32=\"\",\"#N/A\",Report2!E32)","v":"#N/A"},{"$f":"IF(Report2!F32=\"\",\"#N/A\",Report2!F32)","v":"#N/A"},{"$f":"IF(Report2!G32=\"\",\"#N/A\",Report2!G32)","v":"#N/A"},{"$f":"IF(Report2!H32=\"\",DATE(1900,1,1),Report2!H32)","v":"1900-01-01"},{"$f":"IF(Report2!I32=\"\",0,Report2!I32)","v":0},"1900-01-01","1900-01-01",0,"1900-01-01","1900-01-01",0,{"$f":"IF(Report2!J32=\"\",\"#N/A\",Report2!J32)","v":"#N/A"}]
[{"$f":"IF(Report2!D33=\"\",0,Report2!D33)","v":0},{"$f":"IF(Report2!E33=\"\",\"#N/A\",Report2!E33)","v":"#N/A"},{"$f":"IF(Report2!F33=\"\",\"#N/A\",Report2!F33)","v":"#N/A"},{"$f":"IF(Report2!G33=\"\",\"#N/A\",Report2!G33)","v":"#N/A"},{"$f":"IF(Report2!H33=\"\",DATE(1900,1,1),Report2!H33)","v":"1900-01-01"},{"$f":"IF(Report2!I33=\"\",0,Report2!I33)","v":0},"1900-01-01","1900-01-01",0,"1900-01-01","1900-01-01",0,{"$f":"IF(Report2!J33=\"\",\"#N/A\",Report2!J33)","v":"#N/A"}]
[{"$f":"IF(Report2!D34=\"\",0,Report2!D34)","v":0},{"$f":"IF(Report2!E34=\"\",\"#N/A\",Report2!E34)","v":"#N/A"},{"$f":"IF(Report2!F34=\"\",\"#N/A\",Report2!F34)","v":"#N/A"},{"$f":"IF(Report2!G34=\"\",\"#N/A\",Report2!G34)","v":"#N/A"},{"$f":"IF(Report2!H34=\"\",DATE(1900,1,1),Report2!H34)","v":"1900-01-01"},{"$f":"IF(Report2!I34=\"\",0,Report2!I34)","v":0},"1900-01-01","1900-01-01",0,"1900-01-01","1900-01-01",0,{"$f":"IF(Report2!J34=\"\",\"#N/A\",Report2!J34)","v":"#N/A"}]
[{"$f":"IF(Report2!D35=\"\",0,Report2!D35)","v":0},{"$f":"IF(Report2!E35=\"\",\"#N/A\",Report2!E35)","v":"#N/A"},{"$f":"IF(Report2!F35=\"\",\"#N/A\",Report2!F35)","v":"#N/A"},{"$f":"IF(Report2!G35=\"\",\"#N/A\",Report2!G35)","v":"#N/A"},{"$f":"IF(Report2!H35=\"\",DATE(1900,1,1),Report2!H35)","v":"1900-01-01"},{"$f":"IF(Report2!I35=\"\",0,Report2!I35)","v":0},"1900-01-01","1900-01-01",0,"1900-01-01","1900-01-01",0,{"$f":"IF(Report2!J35=\"\",\"#N/A\",Report2!J35)","v":"#N/A"}]
[{"$f":"IF(Report2!D36=\"\",0,Report2!D36)","v":0},{"$f":"IF(Report2!E36=\"\",\"#N/A\",Report2!E36)","v":"#N/A"},{"$f":"IF(Report2!F36=\"\",\"#N/A\",Report2!F36)","v":"#N/A"},{"$f":"IF(Report2!G36=\"\",\"#N/A\",Report2!G36)","v":"#N/A"},{"$f":"IF(Report2!H36=\"\",DATE(1900,1,1),Report2!H36)","v":"1900-01-01"},{"$f":"IF(Report2!I36=\"\",0,Report2!I36)","v":0},"1900-01-01","1900-01-01",0,"1900-01-01","1900-01-01",0,{"$f":"IF(Report2!J36=\"\",\"#N/A\",Report2!J36)","v":"#N/A"}]
[{"$f":"IF(Report2!D37=\"\",0,Report2!D37)","v":0},{"$f":"IF(Report2!E37=\"\",\"#N/A\",Report2!E37)","v":"#N/A"},{"$f":"IF(Report2!F37=\"\",\"#N/A\",Report2!F37)","v":"#N/A"},{"$f":"IF(Report2!G37=\"\",\"#N/A\",Report2!G37)","v":"#N/A"},{"$f":"IF(Report2!H37=\"\",DATE(1900,1,1),Report2!H37)","v":"1900-01-01"},{"$f":"IF(Report2!I37=\"\",0,Report2!I37)","v":0},"1900-01-01","1900-01-01",0,"1900-01-01","1900-01-01",0,{"$f":"IF(Report2!J37=\"\",\"#N/A\",Report2!J37)","v":"#N/A"}]
[{"$f":"IF(Report2!D38=\"\",0,Report2!D38)","v":0},{"$f":"IF(Report2!E38=\"\",\"#N/A\",Report2!E38)","v":"#N/A"},{"$f":"IF(Report2!F38=\"\",\"#N/A\",Report2!F38)","v":"#N/A"},{"$f":"IF(Report2!G38=\"\",\"#N/A\",Report2!G38)","v":"#N/A"},{"$f":"IF(Report2!H38=\"\",DATE(1900,1,1),Report2!H38)","v":"1900-01-01"},{"$f":"IF(Report2!I38=\"\",0,Report2!I38)","v":0},"1900-01-01","1900-01-01",0,"1900-01-01","1900-01-01",0,{"$f":"IF(Report2!J38=\"\",\"#N/A\",Report2!J38)","v":"#N/A"}]
[{"$f":"IF(Report2!D39=\"\",0,Report2!D39)","v":0},{"$f":"IF(Report2!E39=\"\",\"#N/A\",Report2!E39)","v":"#N/A"},{"$f":"IF(Report2!F39=\"\",\"#N/A\",Report2!F39)","v":"#N/A"},{"$f":"IF(Report2!G39=\"\",\"#N/A\",Report2!G39)","v":"#N/A"},{"$f":"IF(Report2!H39=\"\",DATE(1900,1,1),Report2!H39)","v":"1900-01-01"},{"$f":"IF(Report2!I39=\"\",0,Report2!I39)","v":0},"1900-01-01","1900-01-01",0,"1900-01-01","1900-01-01",0,{"$f":"IF(Report2!J39=\"\",\"#N/A\",Report2!J39)","v":"#N/A"}]
[{"$f":"IF(Report2!D40=\"\",0,Report2!D40)","v":0},{"$f":"IF(Report2!E40=\"\",\"#N/A\",Report2!E40)","v":"#N/A"},{"$f":"IF(Report2!F40=\"\",\"#N/A\",Report2!F40)","v":"#N/A"},{"$f":"IF(Report2!G40=\"\",\"#N/A\",Report2!G40)","v":"#N/A"},{"$f":"IF(Report2!H40=\"\",DATE(1900,1,1),Report2!H40)","v":"1900-01-01"},{"$f":"IF(Report2!I40=\"\",0,Report2!I40)","v":0},"1900-01-01","1900-01-01",0,"1900-01-01","1900-01-01",0,{"$f":"IF(Report2!J40=\"\",\"#N/A\",Report2!J40)","v":"#N/A"}]
[{"$f":"IF(Report2!D41=\"\",0,Report2!D41)","v":0},{"$f":"IF(Report2!E41=\"\",\"#N/A\",Report2!E41)","v":"#N/A"},{"$f":"IF(Report2!F41=\"\",\"#N/A\",Report2!F41)","v":"#N/A"},{"$f":"IF(Report2!G41=\"\",\"#N/A\",Report2!G41)","v":"#N/A"},{"$f":"IF(Report2!H41=\"\",DATE(1900,1,1),Report2!H41)","v":"1900-01-01"},{"$f":"IF(Report2!I41=\"\",0,Report2!I41)","v":0},"1900-01-01","1900-01-01",0,"1900-01-01","1900-01-01",0,{"$f":"IF(Report2!J41=\"\",\"#N/A\",Report2!J41)","v":"#N/A"}]
[{"$f":"IF(Report2!D42=\"\",0,Report2!D42)","v":0},{"$f":"IF(Report2!E42=\"\",\"#N/A\",Report2!E42)","v":"#N/A"},{"$f":"IF(Report2!F42=\"\",\"#N/A\",Report2!F42)","v":"#N/A"},{"$f":"IF(Report2!G42=\"\",\"#N/A\",Report2!G42)","v":"#N/A"},{"$f":"IF(Report2!H42=\"\",DATE(1900,1,1),Report2!H42)","v":"1900-01-01"},{"$f":"IF(Report2!I42=\"\",0,Report2!I42)","v":0},"1900-01-01","1900-01-01",0,"1900-01-01","1900-01-01",0,{"$f":"IF(Report2!J42=\"\",\"#N/A\",Report2!J42)","v":"#N/A"}]
[{"$f":"IF(Report2!D43=\"\",0,Report2!D43)","v":0},{"$f":"IF(Report2!E43=\"\",\"#N/A\",Report2!E43)","v":"#N/A"},{"$f":"IF(Report2!F43=\"\",\"#N/A\",Report2!F43)","v":"#N/A"},{"$f":"IF(Report2!G43=\"\",\"#N/A\",Report2!G43)","v":"#N/A"},{"$f":"IF(Report2!H43=\"\",DATE(1900,1,1),Report2!H43)","v":"1900-01-01"},{"$f":"IF(Report2!I43=\"\",0,Report2!I43)","v":0},"1900-01-01","1900-01-01",0,"1900-01-01","1900-01-01",0,{"$f":"IF(Report2!J43=\"\",\"#N/A\",Report2!J43)","v":"#N/A"}]
[{"$f":"IF(Report2!D44=\"\",0,Report2!D44)","v":0},{"$f":"IF(Report2!E44=\"\",\"#N/A\",Report2!E44)","v":"#N/A"},{"$f":"IF(Report2!F44=\"\",\"#N/A\",Report2!F44)","v":"#N/A"},{"$f":"IF(Report2!G44=\"\",\"#N/A\",Report2!G44)","v":"#N/A"},{"$f":"IF(Report2!H44=\"\",DATE(1900,1,1),Report2!H44)","v":"1900-01-01"},{"$f":"IF(Report2!I44=\"\",0,Report2!I44)","v":0},"1900-01-01","1900-01-01",0,"1900-01-01","1900-01-01",0,{"$f":"IF(Report2!J44=\"\",\"#N/A\",Report2!J44)","v":"#N/A"}]
[{"$f":"IF(Report2!D45=\"\",0,Report2!D45)","v":0},{"$f":"IF(Report2!E45=\"\",\"#N/A\",Report2!E45)","v":"#N/A"},{"$f":"IF(Report2!F45=\"\",\"#N/A\",Report2!F45)","v":"#N/A"},{"$f":"IF(Report2!G45=\"\",\"#N/A\",Report2!G45)","v":"#N/A"},{"$f":"IF(Report2!H45=\"\",DATE(1900,1,1),Report2!H45)","v":"1900-01-01"},{"$f":"IF(Report2!I45=\"\",0,Report2!I45)","v":0},"1900-01-01","1900-01-01",0,"1900-01-01","1900-01-01",0,{"$f":"IF(Report2!J45=\"\",\"#N/A\",Report2!J45)","v":"#N/A"}]
[{"$f":"IF(Report2!D46=\"\",0,Report2!D46)","v":0},{"$f":"IF(Report2!E46=\"\",\"#N/A\",Report2!E46)","v":"#N/A"},{"$f":"IF(Report2!F46=\"\",\"#N/A\",Report2!F46)","v":"#N/A"},{"$f":"IF(Report2!G46=\"\",\"#N/A\",Report2!G46)","v":"#N/A"},{"$f":"IF(Report2!H46=\"\",DATE(1900,1,1),Report2!H46)","v":"1900-01-01"},{"$f":"IF(Report2!I46=\"\",0,Report2!I46)","v":0},"1900-01-01","1900-01-01",0,"1900-01-01","1900-01-01",0,{"$f":"IF(Report2!J46=\"\",\"#N/A\",Report2!J46)","v":"#N/A"}]
[{"$f":"IF(Report2!D47=\"\",0,Report2!D47)","v":0},{"$f":"IF(Report2!E47=\"\",\"#N/A\",Report2!E47)","v":"#N/A"},{"$f":"IF(Report2!F47=\"\",\"#N/A\",Report2!F47)","v":"#N/A"},{"$f":"IF(Report2!G47=\"\",\"#N/A\",Report2!G47)","v":"#N/A"},{"$f":"IF(Report2!H47=\"\",DATE(1900,1,1),Report2!H47)","v":"1900-01-01"},{"$f":"IF(Report2!I47=\"\",0,Report2!I47)","v":0},"1900-01-01","1900-01-01",0,"1900-01-01","1900-01-01",0,{"$f":"IF(Report2!J47=\"\",\"#N/A\",Report2!J47)","v":"#N/A"}]
[{"$f":"IF(Report2!D48=\"\",0,Report2!D48)","v":0},{"$f":"IF(Report2!E48=\"\",\"#N/A\",Report2!E48)","v":"#N/A"},{"$f":"IF(Report2!F48=\"\",\"#N/A\",Report2!F48)","v":"#N/A"},{"$f":"IF(Report2!G48=\"\",\"#N/A\",Report2!G48)","v":"#N/A"},{"$f":"IF(Report2!H48=\"\",DATE(1900,1,1),Report2!H48)","v":"1900-01-01"},{"$f":"IF(Report2!I48=\"\",0,Report2!I48)","v":0},"1900-01-01","1900-01-01",0,"1900-01-01","1900-01-01",0,{"$f":"IF(Report2!J48=\"\",\"#N/A\",Report2!J48)","v":"#N/A"}]
[{"$f":"IF(Report2!D49=\"\",0,Report2!D49)","v":0},{"$f":"IF(Report2!E49=\"\",\"#N/A\",Report2!E49)","v":"#N/A"},{"$f":"IF(Report2!F49=\"\",\"#N/A\",Report2!F49)","v":"#N/A"},{"$f":"IF(Report2!G49=\"\",\"#N/A\",Report2!G49)","v":"#N/A"},{"$f":"IF(Report2!H49=\"\",DATE(1900,1,1),Report2!H49)","v":"1900-01-01"},{"$f":"IF(Report2!I49=\"\",0,Report2!I49)","v":0},"1900-01-01","1900-01-01",0,"1900-01-01","1900-01-01",0,{"$f":"IF(Report2!J49=\"\",\"#N/A\",Report2!J49)","v":"#N/A"}]
[{"$f":"IF(Report2!D50=\"\",0,Report2!D50)","v":0},{"$f":"IF(Report2!E50=\"\",\"#N/A\",Report2!E50)","v":"#N/A"},{"$f":"IF(Report2!F50=\"\",\"#N/A\",Report2!F50)","v":"#N/A"},{"$f":"IF(Report2!G50=\"\",\"#N/A\",Report2!G50)","v":"#N/A"},{"$f":"IF(Report2!H50=\"\",DATE(1900,1,1),Report2!H50)","v":"1900-01-01"},{"$f":"IF(Report2!I50=\"\",0,Report2!I50)","v":0},"1900-01-01","1900-01-01",0,"1900-01-01","1900-01-01",0,{"$f":"IF(Report2!J50=\"\",\"#N/A\",Report2!J50)","v":"#N/A"}]
[{"$f":"IF(Report2!D51=\"\",0,Report2!D51)","v":0},{"$f":"IF(Report2!E51=\"\",\"#N/A\",Report2!E51)","v":"#N/A"},{"$f":"IF(Report2!F51=\"\",\"#N/A\",Report2!F51)","v":"#N/A"},{"$f":"IF(Report2!G51=\"\",\"#N/A\",Report2!G51)","v":"#N/A"},{"$f":"IF(Report2!H51=\"\",DATE(1900,1,1),Report2!H51)","v":"1900-01-01"},{"$f":"IF(Report2!I51=\"\",0,Report2!I51)","v":0},"1900-01-01","1900-01-01",0,"1900-01-01","1900-01-01",0,{"$f":"IF(Report2!J51=\"\",\"#N/A\",Report2!J51)","v":"#N/A"}]
[{"$f":"IF(Report2!D52=\"\",0,Report2!D52)","v":0},{"$f":"IF(Report2!E52=\"\",\"#N/A\",Report2!E52)","v":"#N/A"},{"$f":"IF(Report2!F52=\"\",\"#N/A\",Report2!F52)","v":"#N/A"},{"$f":"IF(Report2!G52=\"\",\"#N/A\",Report2!G52)","v":"#N/A"},{"$f":"IF(Report2!H52=\"\",DATE(1900,1,1),Report2!H52)","v":"1900-01-01"},{"$f":"IF(Report2!I52=\"\",0,Report2!I52)","v":0},"1900-01-01","1900-01-01",0,"1900-01-01","1900-01-01",0,{"$f":"IF(Report2!J52=\"\",\"#N/A\",Report2!J52)","v":"#N/A"}]
[{"$f":"IF(Report2!D53=\"\",0,Report2!D53)","v":0},{"$f":"IF(Report2!E53=\"\",\"#N/A\",Report2!E53)","v":"#N/A"},{"$f":"IF(Report2!F53=\"\",\"#N/A\",Report2!F53)","v":"#N/A"},{"$f":"IF(Report2!G53=\"\",\"#N/A\",Report2!G53)","v":"#N/A"},{"$f":"IF(Report2!H53=\"\",DATE(1900,1,1),Report2!H53)","v":"1900-01-01"},{"$f":"IF(Report2!I53=\"\",0,Report2!I53)","v":0},"1900-01-01","1900-01-01",0,"1900-01-01","1900-01-01",0,{"$f":"IF(Report2!J53=\"\",\"#N/A\",Report2!J53)","v":"#N/A"}]
[{"$f":"IF(Report2!D54=\"\",0,Report2!D54)","v":0},{"$f":"IF(Report2!E54=\"\",\"#N/A\",Report2!E54)","v":"#N/A"},{"$f":"IF(Report2!F54=\"\",\"#N/A\",Report2!F54)","v":"#N/A"},{"$f":"IF(Report2!G54=\"\",\"#N/A\",Report2!G54)","v":"#N/A"},{"$f":"IF(Report2!H54=\"\",DATE(1900,1,1),Report2!H54)","v":"1900-01-01"},{"$f":"IF(Report2!I54=\"\",0,Report2!I54)","v":0},"1900-01-01","1900-01-01",0,"1900-01-01","1900-01-01",0,{"$f":"IF(Report2!J54=\"\",\"#N/A\",Report2!J54)","v":"#N/A"}]
[{"$f":"IF(Report2!D55=\"\",0,Report2!D55)","v":0},{"$f":"IF(Report2!E55=\"\",\"#N/A\",Report2!E55)","v":"#N/A"},{"$f":"IF(Report2!F55=\"\",\"#N/A\",Report2!F55)","v":"#N/A"},{"$f":"IF(Report2!G55=\"\",\"#N/A\",Report2!G55)","v":"#N/A"},{"$f":"IF(Report2!H55=\"\",DATE(1900,1,1),Report2!H55)","v":"1900-01-01"},{"$f":"IF(Report2!I55=\"\",0,Report2!I55)","v":0},"1900-01-01","1900-01-01",0,"1900-01-01","1900-01-01",0,{"$f":"IF(Report2!J55=\"\",\"#N/A\",Report2!J55)","v":"#N/A"}]
[{"$f":"IF(Report2!D56=\"\",0,Report2!D56)","v":0},{"$f":"IF(Report2!E56=\"\",\"#N/A\",Report2!E56)","v":"#N/A"},{"$f":"IF(Report2!F56=\"\",\"#N/A\",Report2!F56)","v":"#N/A"},{"$f":"IF(Report2!G56=\"\",\"#N/A\",Report2!G56)","v":"#N/A"},{"$f":"IF(Report2!H56=\"\",DATE(1900,1,1),Report2!H56)","v":"1900-01-01"},{"$f":"IF(Report2!I56=\"\",0,Report2!I56)","v":0},{"$f":"DATE(1900,1,1)","v":"1900-01-01"},"1900-01-01",0,{"$f":"DATE(1900,1,1)","v":"1900-01-01"},"1900-01-01",0,{"$f":"IF(Report2!J56=\"\",\"#N/A\",Report2!J56)","v":"#N/A"}]
[{"$f":"IF(Report2!D57=\"\",0,Report2!D57)","v":0},{"$f":"IF(Report2!E57=\"\",\"#N/A\",Report2!E57)","v":"#N/A"},{"$f":"IF(Report2!F57=\"\",\"#N/A\",Report2!F57)","v":"#N/A"},{"$f":"IF(Report2!G57=\"\",\"#N/A\",Report2!G57)","v":"#N/A"},{"$f":"IF(Report2!H57=\"\",DATE(1900,1,1),Report2!H57)","v":"1900-01-01"},{"$f":"IF(Report2!I57=\"\",0,Report2!I57)","v":0},"1900-01-01","1900-01-01",0,"1900-01-01","1900-01-01",0,{"$f":"IF(Report2!J57=\"\",\"#N/A\",Report2!J57)","v":"#N/A"}]
[{"$f":"IF(Report2!D58=\"\",0,Report2!D58)","v":0},{"$f":"IF(Report2!E58=\"\",\"#N/A\",Report2!E58)","v":"#N/A"},{"$f":"IF(Report2!F58=\"\",\"#N/A\",Report2!F58)","v":"#N/A"},{"$f":"IF(Report2!G58=\"\",\"#N/A\",Report2!G58)","v":"#N/A"},{"$f":"IF(Report2!H58=\"\",DATE(1900,1,1),Report2!H58)","v":"1900-01-01"},{"$f":"IF(Report2!I58=\"\",0,Report2!I58)","v":0},"1900-01-01","1900-01-01",0,"1900-01-01","1900-01-01",0,{"$f":"IF(Report2!J58=\"\",\"#N/A\",Report2!J58)","v":"#N/A"}]
[{"$f":"IF(Report2!D59=\"\",0,Report2!D59)","v":0},{"$f":"IF(Report2!E59=\"\",\"#N/A\",Report2!E59)","v":"#N/A"},{"$f":"IF(Report2!F59=\"\",\"#N/A\",Report2!F59)","v":"#N/A"},{"$f":"IF(Report2!G59=\"\",\"#N/A\",Report2!G59)","v":"#N/A"},{"$f":"IF(Report2!H59=\"\",DATE(1900,1,1),Report2!H59)","v":"1900-01-01"},{"$f":"IF(Report2!I59=\"\",0,Report2!I59)","v":0},"1900-01-01","1900-01-01",0,"1900-01-01","1900-01-01",0,{"$f":"IF(Report2!J59=\"\",\"#N/A\",Report2!J59)","v":"#N/A"}]
[{"$f":"IF(Report2!D60=\"\",0,Report2!D60)","v":0},{"$f":"IF(Report2!E60=\"\",\"#N/A\",Report2!E60)","v":"#N/A"},{"$f":"IF(Report2!F60=\"\",\"#N/A\",Report2!F60)","v":"#N/A"},{"$f":"IF(Report2!G60=\"\",\"#N/A\",Report2!G60)","v":"#N/A"},{"$f":"IF(Report2!H60=\"\",DATE(1900,1,1),Report2!H60)","v":"1900-01-01"},{"$f":"IF(Report2!I60=\"\",0,Report2!I60)","v":0},"1900-01-01","1900-01-01",0,"1900-01-01","1900-01-01",0,{"$f":"IF(Report2!J60=\"\",\"#N/A\",Report2!J60)","v":"#N/A"}]
[{"$f":"IF(Report2!D61=\"\",0,Report2!D61)","v":0},{"$f":"IF(Report2!E61=\"\",\"#N/A\",Report2!E61)","v":"#N/A"},{"$f":"IF(Report2!F61=\"\",\"#N/A\",Report2!F61)","v":"#N/A"},{"$f":"IF(Report2!G61=\"\",\"#N/A\",Report2!G61)","v":"#N/A"},{"$f":"IF(Report2!H61=\"\",DATE(1900,1,1),Report2!H61)","v":"1900-01-01"},{"$f":"IF(Report2!I61=\"\",0,Report2!I61)","v":0},"1900-01-01","1900-01-01",0,"1900-01-01","1900-01-01",0,{"$f":"IF(Report2!J61=\"\",\"#N/A\",Report2!J61)","v":"#N/A"}]
[{"$f":"IF(Report2!D62=\"\",0,Report2!D62)","v":0},{"$f":"IF(Report2!E62=\"\",\"#N/A\",Report2!E62)","v":"#N/A"},{"$f":"IF(Report2!F62=\"\",\"#N/A\",Report2!F62)","v":"#N/A"},{"$f":"IF(Report2!G62=\"\",\"#N/A\",Report2!G62)","v":"#N/A"},{"$f":"IF(Report2!H62=\"\",DATE(1900,1,1),Report2!H62)","v":"1900-01-01"},{"$f":"IF(Report2!I62=\"\",0,Report2!I62)","v":0},"1900-01-01","1900-01-01",0,"1900-01-01","1900-01-01",0,{"$f":"IF(Report2!J62=\"\",\"#N/A\",Report2!J62)","v":"#N/A"}]
[{"$f":"IF(Report2!D63=\"\",0,Report2!D63)","v":0},{"$f":"IF(Report2!E63=\"\",\"#N/A\",Report2!E63)","v":"#N/A"},{"$f":"IF(Report2!F63=\"\",\"#N/A\",Report2!F63)","v":"#N/A"},{"$f":"IF(Report2!G63=\"\",\"#N/A\",Report2!G63)","v":"#N/A"},{"$f":"IF(Report2!H63=\"\",DATE(1900,1,1),Report2!H63)","v":"1900-01-01"},{"$f":"IF(Report2!I63=\"\",0,Report2!I63)","v":0},"1900-01-01","1900-01-01",0,"1900-01-01","1900-01-01",0,{"$f":"IF(Report2!J63=\"\",\"#N/A\",Report2!J63)","v":"#N/A"}]
[{"$f":"IF(Report2!D64=\"\",0,Report2!D64)","v":0},{"$f":"IF(Report2!E64=\"\",\"#N/A\",Report2!E64)","v":"#N/A"},{"$f":"IF(Report2!F64=\"\",\"#N/A\",Report2!F64)","v":"#N/A"},{"$f":"IF(Report2!G64=\"\",\"#N/A\",Report2!G64)","v":"#N/A"},{"$f":"IF(Report2!H64=\"\",DATE(1900,1,1),Report2!H64)","v":"1900-01-01"},{"$f":"IF(Report2!I64=\"\",0,Report2!I64)","v":0},"1900-01-01","1900-01-01",0,"1900-01-01","1900-01-01",0,{"$f":"IF(Report2!J64=\"\",\"#N/A\",Report2!J64)","v":"#N/A"}]
[{"$f":"IF(Report2!D65=\"\",0,Report2!D65)","v":0},{"$f":"IF(Report2!E65=\"\",\"#N/A\",Report2!E65)","v":"#N/A"},{"$f":"IF(Report2!F65=\"\",\"#N/A\",Report2!F65)","v":"#N/A"},{"$f":"IF(Report2!G65=\"\",\"#N/A\",Report2!G65)","v":"#N/A"},{"$f":"IF(Report2!H65=\"\",DATE(1900,1,1),Report2!H65)","v":"1900-01-01"},{"$f":"IF(Report2!I65=\"\",0,Report2!I65)","v":0},"1900-01-01","1900-01-01",0,"1900-01-01","1900-01-01",0,{"$f":"IF(Report2!J65=\"\",\"#N/A\",Report2!J65)","v":"#N/A"}]
[{"$f":"IF(Report2!D66=\"\",0,Report2!D66)","v":0},{"$f":"IF(Report2!E66=\"\",\"#N/A\",Report2!E66)","v":"#N/A"},{"$f":"IF(Report2!F66=\"\",\"#N/A\",Report2!F66)","v":"#N/A"},{"$f":"IF(Report2!G66=\"\",\"#N/A\",Report2!G66)","v":"#N/A"},{"$f":"IF(Report2!H66=\"\",DATE(1900,1,1),Report2!H66)","v":"1900-01-01"},{"$f":"IF(Report2!I66=\"\",0,Report2!I66)","v":0},"1900-01-01","1900-01-01",0,"1900-01-01","1900-01-01",0,{"$f":"IF(Report2!J66=\"\",\"#N/A\",Report2!J66)","v":"#N/A"}]
[{"$f":"IF(Report2!D67=\"\",0,Report2!D67)","v":0},{"$f":"IF(Report2!E67=\"\",\"#N/A\",Report2!E67)","v":"#N/A"},{"$f":"IF(Report2!F67=\"\",\"#N/A\",Report2!F67)","v":"#N/A"},{"$f":"IF(Report2!G67=\"\",\"#N/A\",Report2!G67)","v":"#N/A"},{"$f":"IF(Report2!H67=\"\",DATE(1900,1,1),Report2!H67)","v":"1900-01-01"},{"$f":"IF(Report2!I67=\"\",0,Report2!I67)","v":0},"1900-01-01","1900-01-01",0,"1900-01-01","1900-01-01",0,{"$f":"IF(Report2!J67=\"\",\"#N/A\",Report2!J67)","v":"#N/A"}]
[{"$f":"IF(Report2!D68=\"\",0,Report2!D68)","v":0},{"$f":"IF(Report2!E68=\"\",\"#N/A\",Report2!E68)","v":"#N/A"},{"$f":"IF(Report2!F68=\"\",\"#N/A\",Report2!F68)","v":"#N/A"},{"$f":"IF(Report2!G68=\"\",\"#N/A\",Report2!G68)","v":"#N/A"},{"$f":"IF(Report2!H68=\"\",DATE(1900,1,1),Report2!H68)","v":"1900-01-01"},{"$f":"IF(Report2!I68=\"\",0,Report2!I68)","v":0},"1900-01-01","1900-01-01",0,"1900-01-01","1900-01-01",0,{"$f":"IF(Report2!J68=\"\",\"#N/A\",Report2!J68)","v":"#N/A"}]
[{"$f":"IF(Report2!D69=\"\",0,Report2!D69)","v":0},{"$f":"IF(Report2!E69=\"\",\"#N/A\",Report2!E69)","v":"#N/A"},{"$f":"IF(Report2!F69=\"\",\"#N/A\",Report2!F69)","v":"#N/A"},{"$f":"IF(Report2!G69=\"\",\"#N/A\",Report2!G69)","v":"#N/A"},{"$f":"IF(Report2!H69=\"\",DATE(1900,1,1),Report2!H69)","v":"1900-01-01"},{"$f":"IF(Report2!I69=\"\",0,Report2!I69)","v":0},"1900-01-01","1900-01-01",0,"1900-01-01","1900-01-01",0,{"$f":"IF(Report2!J69=\"\",\"#N/A\",Report2!J69)","v":"#N/A"}]
[{"$f":"IF(Report2!D70=\"\",0,Report2!D70)","v":0},{"$f":"IF(Report2!E70=\"\",\"#N/A\",Report2!E70)","v":"#N/A"},{"$f":"IF(Report2!F70=\"\",\"#N/A\",Report2!F70)","v":"#N/A"},{"$f":"IF(Report2!G70=\"\",\"#N/A\",Report2!G70)","v":"#N/A"},{"$f":"IF(Report2!H70=\"\",DATE(1900,1,1),Report2!H70)","v":"1900-01-01"},{"$f":"IF(Report2!I70=\"\",0,Report2!I70)","v":0},"1900-01-01","1900-01-01",0,"1900-01-01","1900-01-01",0,{"$f":"IF(Report2!J70=\"\",\"#N/A\",Report2!J70)","v":"#N/A"}]
[{"$f":"IF(Report2!D71=\"\",0,Report2!D71)","v":0},{"$f":"IF(Report2!E71=\"\",\"#N/A\",Report2!E71)","v":"#N/A"},{"$f":"IF(Report2!F71=\"\",\"#N/A\",Report2!F71)","v":"#N/A"},{"$f":"IF(Report2!G71=\"\",\"#N/A\",Report2!G71)","v":"#N/A"},{"$f":"IF(Report2!H71=\"\",DATE(1900,1,1),Report2!H71)","v":"1900-01-01"},{"$f":"IF(Report2!I71=\"\",0,Report2!I71)","v":0},"1900-01-01","1900-01-01",0,"1900-01-01","1900-01-01",0,{"$f":"IF(Report2!J71=\"\",\"#N/A\",Report2!J71)","v":"#N/A"}]
[{"$f":"IF(Report2!D72=\"\",0,Report2!D72)","v":0},{"$f":"IF(Report2!E72=\"\",\"#N/A\",Report2!E72)","v":"#N/A"},{"$f":"IF(Report2!F72=\"\",\"#N/A\",Report2!F72)","v":"#N/A"},{"$f":"IF(Report2!G72=\"\",\"#N/A\",Report2!G72)","v":"#N/A"},{"$f":"IF(Report2!H72=\"\",DATE(1900,1,1),Report2!H72)","v":"1900-01-01"},{"$f":"IF(Report2!I72=\"\",0,Report2!I72)","v":0},"1900-01-01","1900-01-01",0,"1900-01-01","1900-01-01",0,{"$f":"IF(Report2!J72=\"\",\"#N/A\",Report2!J72)","v":"#N/A"}]
[{"$f":"IF(Report2!D73=\"\",0,Report2!D73)","v":0},{"$f":"IF(Report2!E73=\"\",\"#N/A\",Report2!E73)","v":"#N/A"},{"$f":"IF(Report2!F73=\"\",\"#N/A\",Report2!F73)","v":"#N/A"},{"$f":"IF(Report2!G73=\"\",\"#N/A\",Report2!G73)","v":"#N/A"},{"$f":"IF(Report2!H73=\"\",DATE(1900,1,1),Report2!H73)","v":"1900-01-01"},{"$f":"IF(Report2!I73=\"\",0,Report2!I73)","v":0},"1900-01-01","1900-01-01",0,"1900-01-01","1900-01-01",0,{"$f":"IF(Report2!J73=\"\",\"#N/A\",Report2!J73)","v":"#N/A"}]
[{"$f":"IF(Report2!D74=\"\",0,Report2!D74)","v":0},{"$f":"IF(Report2!E74=\"\",\"#N/A\",Report2!E74)","v":"#N/A"},{"$f":"IF(Report2!F74=\"\",\"#N/A\",Report2!F74)","v":"#N/A"},{"$f":"IF(Report2!G74=\"\",\"#N/A\",Report2!G74)","v":"#N/A"},{"$f":"IF(Report2!H74=\"\",DATE(1900,1,1),Report2!H74)","v":"1900-01-01"},{"$f":"IF(Report2!I74=\"\",0,Report2!I74)","v":0},"1900-01-01","1900-01-01",0,"1900-01-01","1900-01-01",0,{"$f":"IF(Report2!J74=\"\",\"#N/A\",Report2!J74)","v":"#N/A"}]
[{"$f":"IF(Report2!D75=\"\",0,Report2!D75)","v":0},{"$f":"IF(Report2!E75=\"\",\"#N/A\",Report2!E75)","v":"#N/A"},{"$f":"IF(Report2!F75=\"\",\"#N/A\",Report2!F75)","v":"#N/A"},{"$f":"IF(Report2!G75=\"\",\"#N/A\",Report2!G75)","v":"#N/A"},{"$f":"IF(Report2!H75=\"\",DATE(1900,1,1),Report2!H75)","v":"1900-01-01"},{"$f":"IF(Report2!I75=\"\",0,Report2!I75)","v":0},"1900-01-01","1900-01-01",0,"1900-01-01","1900-01-01",0,{"$f":"IF(Report2!J75=\"\",\"#N/A\",Report2!J75)","v":"#N/A"}]
[{"$f":"IF(Report2!D76=\"\",0,Report2!D76)","v":0},{"$f":"IF(Report2!E76=\"\",\"#N/A\",Report2!E76)","v":"#N/A"},{"$f":"IF(Report2!F76=\"\",\"#N/A\",Report2!F76)","v":"#N/A"},{"$f":"IF(Report2!G76=\"\",\"#N/A\",Report2!G76)","v":"#N/A"},{"$f":"IF(Report2!H76=\"\",DATE(1900,1,1),Report2!H76)","v":"1900-01-01"},{"$f":"IF(Report2!I76=\"\",0,Report2!I76)","v":0},"1900-01-01","1900-01-01",0,"1900-01-01","1900-01-01",0,{"$f":"IF(Report2!J76=\"\",\"#N/A\",Report2!J76)","v":"#N/A"}]
[{"$f":"IF(Report2!D77=\"\",0,Report2!D77)","v":0},{"$f":"IF(Report2!E77=\"\",\"#N/A\",Report2!E77)","v":"#N/A"},{"$f":"IF(Report2!F77=\"\",\"#N/A\",Report2!F77)","v":"#N/A"},{"$f":"IF(Report2!G77=\"\",\"#N/A\",Report2!G77)","v":"#N/A"},{"$f":"IF(Report2!H77=\"\",DATE(1900,1,1),Report2!H77)","v":"1900-01-01"},{"$f":"IF(Report2!I77=\"\",0,Report2!I77)","v":0},"1900-01-01","1900-01-01",0,"1900-01-01","1900-01-01",0,{"$f":"IF(Report2!J77=\"\",\"#N/A\",Report2!J77)","v":"#N/A"}]
[{"$f":"IF(Report2!D78=\"\",0,Report2!D78)","v":0},{"$f":"IF(Report2!E78=\"\",\"#N/A\",Report2!E78)","v":"#N/A"},{"$f":"IF(Report2!F78=\"\",\"#N/A\",Report2!F78)","v":"#N/A"},{"$f":"IF(Report2!G78=\"\",\"#N/A\",Report2!G78)","v":"#N/A"},{"$f":"IF(Report2!H78=\"\",DATE(1900,1,1),Report2!H78)","v":"1900-01-01"},{"$f":"IF(Report2!I78=\"\",0,Report2!I78)","v":0},"1900-01-01","1900-01-01",0,"1900-01-01","1900-01-01",0,{"$f":"IF(Report2!J78=\"\",\"#N/A\",Report2!J78)","v":"#N/A"}]
[{"$f":"IF(Report2!D79=\"\",0,Report2!D79)","v":0},{"$f":"IF(Report2!E79=\"\",\"#N/A\",Report2!E79)","v":"#N/A"},{"$f":"IF(Report2!F79=\"\",\"#N/A\",Report2!F79)","v":"#N/A"},{"$f":"IF(Report2!G79=\"\",\"#N/A\",Report2!G79)","v":"#N/A"},{"$f":"IF(Report2!H79=\"\",DATE(1900,1,1),Report2!H79)","v":"1900-01-01"},{"$f":"IF(Report2!I79=\"\",0,Report2!I79)","v":0},"1900-01-01","1900-01-01",0,"1900-01-01","1900-01-01",0,{"$f":"IF(Report2!J79=\"\",\"#N/A\",Report2!J79)","v":"#N/A"}]
[{"$f":"IF(Report2!D80=\"\",0,Report2!D80)","v":0},{"$f":"IF(Report2!E80=\"\",\"#N/A\",Report2!E80)","v":"#N/A"},{"$f":"IF(Report2!F80=\"\",\"#N/A\",Report2!F80)","v":"#N/A"},{"$f":"IF(Report2!G80=\"\",\"#N/A\",Report2!G80)","v":"#N/A"},{"$f":"IF(Report2!H80=\"\",DATE(1900,1,1),Report2!H80)","v":"1900-01-01"},{"$f":"IF(Report2!I80=\"\",0,Report2!I80)","v":0},"1900-01-01","1900-01-01",0,"1900-01-01","1900-01-01",0,{"$f":"IF(Report2!J80=\"\",\"#N/A\",Report2!J80)","v":"#N/A"}]
[{"$f":"IF(Report2!D81=\"\",0,Report2!D81)","v":0},{"$f":"IF(Report2!E81=\"\",\"#N/A\",Report2!E81)","v":"#N/A"},{"$f":"IF(Report2!F81=\"\",\"#N/A\",Report2!F81)","v":"#N/A"},{"$f":"IF(Report2!G81=\"\",\"#N/A\",Report2!G81)","v":"#N/A"},{"$f":"IF(Report2!H81=\"\",DATE(1900,1,1),Report2!H81)","v":"1900-01-01"},{"$f":"IF(Report2!I81=\"\",0,Report2!I81)","v":0},"1900-01-01","1900-01-01",0,"1900-01-01","1900-01-01",0,{"$f":"IF(Report2!J81=\"\",\"#N/A\",Report2!J81)","v":"#N/A"}]
[{"$f":"IF(Report2!D82=\"\",0,Report2!D82)","v":0},{"$f":"IF(Report2!E82=\"\",\"#N/A\",Report2!E82)","v":"#N/A"},{"$f":"IF(Report2!F82=\"\",\"#N/A\",Report2!F82)","v":"#N/A"},{"$f":"IF(Report2!G82=\"\",\"#N/A\",Report2!G82)","v":"#N/A"},{"$f":"IF(Report2!H82=\"\",DATE(1900,1,1),Report2!H82)","v":"1900-01-01"},{"$f":"IF(Report2!I82=\"\",0,Report2!I82)","v":0},"1900-01-01","1900-01-01",0,"1900-01-01","1900-01-01",0,{"$f":"IF(Report2!J82=\"\",\"#N/A\",Report2!J82)","v":"#N/A"}]
[{"$f":"IF(Report2!D83=\"\",0,Report2!D83)","v":0},{"$f":"IF(Report2!E83=\"\",\"#N/A\",Report2!E83)","v":"#N/A"},{"$f":"IF(Report2!F83=\"\",\"#N/A\",Report2!F83)","v":"#N/A"},{"$f":"IF(Report2!G83=\"\",\"#N/A\",Report2!G83)","v":"#N/A"},{"$f":"IF(Report2!H83=\"\",DATE(1900,1,1),Report2!H83)","v":"1900-01-01"},{"$f":"IF(Report2!I83=\"\",0,Report2!I83)","v":0},"1900-01-01","1900-01-01",0,"1900-01-01","1900-01-01",0,{"$f":"IF(Report2!J83=\"\",\"#N/A\",Report2!J83)","v":"#N/A"}]
[{"$f":"IF(Report2!D84=\"\",0,Report2!D84)","v":0},{"$f":"IF(Report2!E84=\"\",\"#N/A\",Report2!E84)","v":"#N/A"},{"$f":"IF(Report2!F84=\"\",\"#N/A\",Report2!F84)","v":"#N/A"},{"$f":"IF(Report2!G84=\"\",\"#N/A\",Report2!G84)","v":"#N/A"},{"$f":"IF(Report2!H84=\"\",DATE(1900,1,1),Report2!H84)","v":"1900-01-01"},{"$f":"IF(Report2!I84=\"\",0,Report2!I84)","v":0},"1900-01-01","1900-01-01",0,"1900-01-01","1900-01-01",0,{"$f":"IF(Report2!J84=\"\",\"#N/A\",Report2!J84)","v":"#N/A"}]
[{"$f":"IF(Report2!D85=\"\",0,Report2!D85)","v":0},{"$f":"IF(Report2!E85=\"\",\"#N/A\",Report2!E85)","v":"#N/A"},{"$f":"IF(Report2!F85=\"\",\"#N/A\",Report2!F85)","v":"#N/A"},{"$f":"IF(Report2!G85=\"\",\"#N/A\",Report2!G85)","v":"#N/A"},{"$f":"IF(Report2!H85=\"\",DATE(1900,1,1),Report2!H85)","v":"1900-01-01"},{"$f":"IF(Report2!I85=\"\",0,Report2!I85)","v":0},"1900-01-01","1900-01-01",0,"1900-01-01","1900-01-01",0,{"$f":"IF(Report2!J85=\"\",\"#N/A\",Report2!J85)","v":"#N/A"}]
[{"$f":"IF(Report2!D86=\"\",0,Report2!D86)","v":0},{"$f":"IF(Report2!E86=\"\",\"#N/A\",Report2!E86)","v":"#N/A"},{"$f":"IF(Report2!F86=\"\",\"#N/A\",Report2!F86)","v":"#N/A"},{"$f":"IF(Report2!G86=\"\",\"#N/A\",Report2!G86)","v":"#N/A"},{"$f":"IF(Report2!H86=\"\",DATE(1900,1,1),Report2!H86)","v":"1900-01-01"},{"$f":"IF(Report2!I86=\"\",0,Report2!I86)","v":0},"1900-01-01","1900-01-01",0,"1900-01-01","1900-01-01",0,{"$f":"IF(Report2!J86=\"\",\"#N/A\",Report2!J86)","v":"#N/A"}]
[{"$f":"IF(Report2!D87=\"\",0,Report2!D87)","v":0},{"$f":"IF(Report2!E87=\"\",\"#N/A\",Report2!E87)","v":"#N/A"},{"$f":"IF(Report2!F87=\"\",\"#N/A\",Report2!F87)","v":"#N/A"},{"$f":"IF(Report2!G87=\"\",\"#N/A\",Report2!G87)","v":"#N/A"},{"$f":"IF(Report2!H87=\"\",DATE(1900,1,1),Report2!H87)","v":"1900-01-01"},{"$f":"IF(Report2!I87=\"\",0,Report2!I87)","v":0},"1900-01-01","1900-01-01",0,"1900-01-01","1900-01-01",0,{"$f":"IF(Report2!J87=\"\",\"#N/A\",Report2!J87)","v":"#N/A"}]
[{"$f":"IF(Report2!D88=\"\",0,Report2!D88)","v":0},{"$f":"IF(Report2!E88=\"\",\"#N/A\",Report2!E88)","v":"#N/A"},{"$f":"IF(Report2!F88=\"\",\"#N/A\",Report2!F88)","v":"#N/A"},{"$f":"IF(Report2!G88=\"\",\"#N/A\",Report2!G88)","v":"#N/A"},{"$f":"IF(Report2!H88=\"\",DATE(1900,1,1),Report2!H88)","v":"1900-01-01"},{"$f":"IF(Report2!I88=\"\",0,Report2!I88)","v":0},"1900-01-01","1900-01-01",0,{"$f":"DATE(1900,1,1)","v":"1900-01-01"},"1900-01-01",0,{"$f":"IF(Report2!J88=\"\",\"#N/A\",Report2!J88)","v":"#N/A"}]
[{"$f":"IF(Report2!D89=\"\",0,Report2!D89)","v":0},{"$f":"IF(Report2!E89=\"\",\"#N/A\",Report2!E89)","v":"#N/A"},{"$f":"IF(Report2!F89=\"\",\"#N/A\",Report2!F89)","v":"#N/A"},{"$f":"IF(Report2!G89=\"\",\"#N/A\",Report2!G89)","v":"#N/A"},{"$f":"IF(Report2!H89=\"\",DATE(1900,1,1),Report2!H89)","v":"1900-01-01"},{"$f":"IF(Report2!I89=\"\",0,Report2!I89)","v":0},"1900-01-01","1900-01-01",0,"1900-01-01","1900-01-01",0,{"$f":"IF(Report2!J89=\"\",\"#N/A\",Report2!J89)","v":"#N/A"}]
[{"$f":"IF(Report2!D90=\"\",0,Report2!D90)","v":0},{"$f":"IF(Report2!E90=\"\",\"#N/A\",Report2!E90)","v":"#N/A"},{"$f":"IF(Report2!F90=\"\",\"#N/A\",Report2!F90)","v":"#N/A"},{"$f":"IF(Report2!G90=\"\",\"#N/A\",Report2!G90)","v":"#N/A"},{"$f":"IF(Report2!H90=\"\",DATE(1900,1,1),Report2!H90)","v":"1900-01-01"},{"$f":"IF(Report2!I90=\"\",0,Report2!I90)","v":0},"1900-01-01","1900-01-01",0,"1900-01-01","1900-01-01",0,{"$f":"IF(Report2!J90=\"\",\"#N/A\",Report2!J90)","v":"#N/A"}]
[{"$f":"IF(Report2!D91=\"\",0,Report2!D91)","v":0},{"$f":"IF(Report2!E91=\"\",\"#N/A\",Report2!E91)","v":"#N/A"},{"$f":"IF(Report2!F91=\"\",\"#N/A\",Report2!F91)","v":"#N/A"},{"$f":"IF(Report2!G91=\"\",\"#N/A\",Report2!G91)","v":"#N/A"},{"$f":"IF(Report2!H91=\"\",DATE(1900,1,1),Report2!H91)","v":"1900-01-01"},{"$f":"IF(Report2!I91=\"\",0,Report2!I91)","v":0},"1900-01-01","1900-01-01",0,"1900-01-01","1900-01-01",0,{"$f":"IF(Report2!J91=\"\",\"#N/A\",Report2!J91)","v":"#N/A"}]
[{"$f":"IF(Report2!D92=\"\",0,Report2!D92)","v":0},{"$f":"IF(Report2!E92=\"\",\"#N/A\",Report2!E92)","v":"#N/A"},{"$f":"IF(Report2!F92=\"\",\"#N/A\",Report2!F92)","v":"#N/A"},{"$f":"IF(Report2!G92=\"\",\"#N/A\",Report2!G92)","v":"#N/A"},{"$f":"IF(Report2!H92=\"\",DATE(1900,1,1),Report2!H92)","v":"1900-01-01"},{"$f":"IF(Report2!I92=\"\",0,Report2!I92)","v":0},"1900-01-01","1900-01-01",0,"1900-01-01","1900-01-01",0,{"$f":"IF(Report2!J92=\"\",\"#N/A\",Report2!J92)","v":"#N/A"}]
[{"$f":"IF(Report2!D93=\"\",0,Report2!D93)","v":0},{"$f":"IF(Report2!E93=\"\",\"#N/A\",Report2!E93)","v":"#N/A"},{"$f":"IF(Report2!F93=\"\",\"#N/A\",Report2!F93)","v":"#N/A"},{"$f":"IF(Report2!G93=\"\",\"#N/A\",Report2!G93)","v":"#N/A"},{"$f":"IF(Report2!H93=\"\",DATE(1900,1,1),Report2!H93)","v":"1900-01-01"},{"$f":"IF(Report2!I93=\"\",0,Report2!I93)","v":0},"1900-01-01","1900-01-01",0,"1900-01-01","1900-01-01",0,{"$f":"IF(Report2!J93=\"\",\"#N/A\",Report2!J93)","v":"#N/A"}]
[{"$f":"IF(Report2!D94=\"\",0,Report2!D94)","v":0},{"$f":"IF(Report2!E94=\"\",\"#N/A\",Report2!E94)","v":"#N/A"},{"$f":"IF(Report2!F94=\"\",\"#N/A\",Report2!F94)","v":"#N/A"},{"$f":"IF(Report2!G94=\"\",\"#N/A\",Report2!G94)","v":"#N/A"},{"$f":"IF(Report2!H94=\"\",DATE(1900,1,1),Report2!H94)","v":"1900-01-01"},{"$f":"IF(Report2!I94=\"\",0,Report2!I94)","v":0},"1900-01-01","1900-01-01",0,"1900-01-01","1900-01-01",0,{"$f":"IF(Report2!J94=\"\",\"#N/A\",Report2!J94)","v":"#N/A"}]
[{"$f":"IF(Report2!D95=\"\",0,Report2!D95)","v":0},{"$f":"IF(Report2!E95=\"\",\"#N/A\",Report2!E95)","v":"#N/A"},{"$f":"IF(Report2!F95=\"\",\"#N/A\",Report2!F95)","v":"#N/A"},{"$f":"IF(Report2!G95=\"\",\"#N/A\",Report2!G95)","v":"#N/A"},{"$f":"IF(Report2!H95=\"\",DATE(1900,1,1),Report2!H95)","v":"1900-01-01"},{"$f":"IF(Report2!I95=\"\",0,Report2!I95)","v":0},"1900-01-01","1900-01-01",0,"1900-01-01","1900-01-01",0,{"$f":"IF(Report2!J95=\"\",\"#N/A\",Report2!J95)","v":"#N/A"}]
[{"$f":"IF(Report2!D96=\"\",0,Report2!D96)","v":0},{"$f":"IF(Report2!E96=\"\",\"#N/A\",Report2!E96)","v":"#N/A"},{"$f":"IF(Report2!F96=\"\",\"#N/A\",Report2!F96)","v":"#N/A"},{"$f":"IF(Report2!G96=\"\",\"#N/A\",Report2!G96)","v":"#N/A"},{"$f":"IF(Report2!H96=\"\",DATE(1900,1,1),Report2!H96)","v":"1900-01-01"},{"$f":"IF(Report2!I96=\"\",0,Report2!I96)","v":0},"1900-01-01","1900-01-01",0,"1900-01-01","1900-01-01",0,{"$f":"IF(Report2!J96=\"\",\"#N/A\",Report2!J96)","v":"#N/A"}]
[{"$f":"IF(Report2!D97=\"\",0,Report2!D97)","v":0},{"$f":"IF(Report2!E97=\"\",\"#N/A\",Report2!E97)","v":"#N/A"},{"$f":"IF(Report2!F97=\"\",\"#N/A\",Report2!F97)","v":"#N/A"},{"$f":"IF(Report2!G97=\"\",\"#N/A\",Report2!G97)","v":"#N/A"},{"$f":"IF(Report2!H97=\"\",DATE(1900,1,1),Report2!H97)","v":"1900-01-01"},{"$f":"IF(Report2!I97=\"\",0,Report2!I97)","v":0},"1900-01-01","1900-01-01",0,"1900-01-01","1900-01-01",0,{"$f":"IF(Report2!J97=\"\",\"#N/A\",Report2!J97)","v":"#N/A"}]
[{"$f":"IF(Report2!D98=\"\",0,Report2!D98)","v":0},{"$f":"IF(Report2!E98=\"\",\"#N/A\",Report2!E98)","v":"#N/A"},{"$f":"IF(Report2!F98=\"\",\"#N/A\",Report2!F98)","v":"#N/A"},{"$f":"IF(Report2!G98=\"\",\"#N/A\",Report2!G98)","v":"#N/A"},{"$f":"IF(Report2!H98=\"\",DATE(1900,1,1),Report2!H98)","v":"1900-01-01"},{"$f":"IF(Report2!I98=\"\",0,Report2!I98)","v":0},"1900-01-01","1900-01-01",0,"1900-01-01","1900-01-01",0,{"$f":"IF(Report2!J98=\"\",\"#N/A\",Report2!J98)","v":"#N/A"}]
[{"$f":"IF(Report2!D99=\"\",0,Report2!D99)","v":0},{"$f":"IF(Report2!E99=\"\",\"#N/A\",Report2!E99)","v":"#N/A"},{"$f":"IF(Report2!F99=\"\",\"#N/A\",Report2!F99)","v":"#N/A"},{"$f":"IF(Report2!G99=\"\",\"#N/A\",Report2!G99)","v":"#N/A"},{"$f":"IF(Report2!H99=\"\",DATE(1900,1,1),Report2!H99)","v":"1900-01-01"},{"$f":"IF(Report2!I99=\"\",0,Report2!I99)","v":0},"1900-01-01","1900-01-01",0,"1900-01-01","1900-01-01",0,{"$f":"IF(Report2!J99=\"\",\"#N/A\",Report2!J99)","v":"#N/A"}]
[{"$f":"IF(Report2!D100=\"\",0,Report2!D100)","v":0},{"$f":"IF(Report2!E100=\"\",\"#N/A\",Report2!E100)","v":"#N/A"},{"$f":"IF(Report2!F100=\"\",\"#N/A\",Report2!F100)","v":"#N/A"},{"$f":"IF(Report2!G100=\"\",\"#N/A\",Report2!G100)","v":"#N/A"},{"$f":"IF(Report2!H100=\"\",DATE(1900,1,1),Report2!H100)","v":"1900-01-01"},{"$f":"IF(Report2!I100=\"\",0,Report2!I100)","v":0},"1900-01-01","1900-01-01",0,"1900-01-01","1900-01-01",0,{"$f":"IF(Report2!J100=\"\",\"#N/A\",Report2!J100)","v":"#N/A"}]
[{"$f":"IF(Report2!D101=\"\",0,Report2!D101)","v":0},{"$f":"IF(Report2!E101=\"\",\"#N/A\",Report2!E101)","v":"#N/A"},{"$f":"IF(Report2!F101=\"\",\"#N/A\",Report2!F101)","v":"#N/A"},{"$f":"IF(Report2!G101=\"\",\"#N/A\",Report2!G101)","v":"#N/A"},{"$f":"IF(Report2!H101=\"\",DATE(1900,1,1),Report2!H101)","v":"1900-01-01"},{"$f":"IF(Report2!I101=\"\",0,Report2!I101)","v":0},"1900-01-01","1900-01-01",0,"1900-01-01","1900-01-01",0,{"$f":"IF(Report2!J101=\"\",\"#N/A\",Report2!J101)","v":"#N/A"}]
[{"$f":"IF(Report2!D102=\"\",0,Report2!D102)","v":0},{"$f":"IF(Report2!E102=\"\",\"#N/A\",Report2!E102)","v":"#N/A"},{"$f":"IF(Report2!F102=\"\",\"#N/A\",Report2!F102)","v":"#N/A"},{"$f":"IF(Report2!G102=\"\",\"#N/A\",Report2!G102)","v":"#N/A"},{"$f":"IF(Report2!H102=\"\",DATE(1900,1,1),Report2!H102)","v":"1900-01-01"},{"$f":"IF(Report2!I102=\"\",0,Report2!I102)","v":0},"1900-01-01","1900-01-01",0,"1900-01-01","1900-01-01",0,{"$f":"IF(Report2!J102=\"\",\"#N/A\",Report2!J102)","v":"#N/A"}]
[{"$f":"IF(Report2!D103=\"\",0,Report2!D103)","v":0},{"$f":"IF(Report2!E103=\"\",\"#N/A\",Report2!E103)","v":"#N/A"},{"$f":"IF(Report2!F103=\"\",\"#N/A\",Report2!F103)","v":"#N/A"},{"$f":"IF(Report2!G103=\"\",\"#N/A\",Report2!G103)","v":"#N/A"},{"$f":"IF(Report2!H103=\"\",DATE(1900,1,1),Report2!H103)","v":"1900-01-01"},{"$f":"IF(Report2!I103=\"\",0,Report2!I103)","v":0},"1900-01-01","1900-01-01",0,"1900-01-01","1900-01-01",0,{"$f":"IF(Report2!J103=\"\",\"#N/A\",Report2!J103)","v":"#N/A"}]
[{"$f":"IF(Report2!D104=\"\",0,Report2!D104)","v":0},{"$f":"IF(Report2!E104=\"\",\"#N/A\",Report2!E104)","v":"#N/A"},{"$f":"IF(Report2!F104=\"\",\"#N/A\",Report2!F104)","v":"#N/A"},{"$f":"IF(Report2!G104=\"\",\"#N/A\",Report2!G104)","v":"#N/A"},{"$f":"IF(Report2!H104=\"\",DATE(1900,1,1),Report2!H104)","v":"1900-01-01"},{"$f":"IF(Report2!I104=\"\",0,Report2!I104)","v":0},"1900-01-01","1900-01-01",0,"1900-01-01","1900-01-01",0,{"$f":"IF(Report2!J104=\"\",\"#N/A\",Report2!J104)","v":"#N/A"}]
[{"$f":"IF(Report2!D105=\"\",0,Report2!D105)","v":0},{"$f":"IF(Report2!E105=\"\",\"#N/A\",Report2!E105)","v":"#N/A"},{"$f":"IF(Report2!F105=\"\",\"#N/A\",Report2!F105)","v":"#N/A"},{"$f":"IF(Report2!G105=\"\",\"#N/A\",Report2!G105)","v":"#N/A"},{"$f":"IF(Report2!H105=\"\",DATE(1900,1,1),Report2!H105)","v":"1900-01-01"},{"$f":"IF(Report2!I105=\"\",0,Report2!I105)","v":0},"1900-01-01","1900-01-01",0,"1900-01-01","1900-01-01",0,{"$f":"IF(Report2!J105=\"\",\"#N/A\",Report2!J105)","v":"#N/A"}]
[{"$f":"IF(Report2!D106=\"\",0,Report2!D106)","v":0},{"$f":"IF(Report2!E106=\"\",\"#N/A\",Report2!E106)","v":"#N/A"},{"$f":"IF(Report2!F106=\"\",\"#N/A\",Report2!F106)","v":"#N/A"},{"$f":"IF(Report2!G106=\"\",\"#N/A\",Report2!G106)","v":"#N/A"},{"$f":"IF(Report2!H106=\"\",DATE(1900,1,1),Report2!H106)","v":"1900-01-01"},{"$f":"IF(Report2!I106=\"\",0,Report2!I106)","v":0},"1900-01-01","1900-01-01",0,"1900-01-01","1900-01-01",0,{"$f":"IF(Report2!J106=\"\",\"#N/A\",Report2!J106)","v":"#N/A"}]
[{"$f":"IF(Report2!D107=\"\",0,Report2!D107)","v":0},{"$f":"IF(Report2!E107=\"\",\"#N/A\",Report2!E107)","v":"#N/A"},{"$f":"IF(Report2!F107=\"\",\"#N/A\",Report2!F107)","v":"#N/A"},{"$f":"IF(Report2!G107=\"\",\"#N/A\",Report2!G107)","v":"#N/A"},{"$f":"IF(Report2!H107=\"\",DATE(1900,1,1),Report2!H107)","v":"1900-01-01"},{"$f":"IF(Report2!I107=\"\",0,Report2!I107)","v":0},"1900-01-01","1900-01-01",0,"1900-01-01","1900-01-01",0,{"$f":"IF(Report2!J107=\"\",\"#N/A\",Report2!J107)","v":"#N/A"}]
[{"$f":"IF(Report2!D108=\"\",0,Report2!D108)","v":0},{"$f":"IF(Report2!E108=\"\",\"#N/A\",Report2!E108)","v":"#N/A"},{"$f":"IF(Report2!F108=\"\",\"#N/A\",Report2!F108)","v":"#N/A"},{"$f":"IF(Report2!G108=\"\",\"#N/A\",Report2!G108)","v":"#N/A"},{"$f":"IF(Report2!H108=\"\",DATE(1900,1,1),Report2!H108)","v":"1900-01-01"},{"$f":"IF(Report2!I108=\"\",0,Report2!I108)","v":0},"1900-01-01","1900-01-01",0,"1900-01-01","1900-01-01",0,{"$f":"IF(Report2!J108=\"\",\"#N/A\",Report2!J108)","v":"#N/A"}]
[{"$f":"IF(Report2!D109=\"\",0,Report2!D109)","v":0},{"$f":"IF(Report2!E109=\"\",\"#N/A\",Report2!E109)","v":"#N/A"},{"$f":"IF(Report2!F109=\"\",\"#N/A\",Report2!F109)","v":"#N/A"},{"$f":"IF(Report2!G109=\"\",\"#N/A\",Report2!G109)","v":"#N/A"},{"$f":"IF(Report2!H109=\"\",DATE(1900,1,1),Report2!H109)","v":"1900-01-01"},{"$f":"IF(Report2!I109=\"\",0,Report2!I109)","v":0},"1900-01-01","1900-01-01",0,"1900-01-01","1900-01-01",0,{"$f":"IF(Report2!J109=\"\",\"#N/A\",Report2!J109)","v":"#N/A"}]
[{"$f":"IF(Report2!D110=\"\",0,Report2!D110)","v":0},{"$f":"IF(Report2!E110=\"\",\"#N/A\",Report2!E110)","v":"#N/A"},{"$f":"IF(Report2!F110=\"\",\"#N/A\",Report2!F110)","v":"#N/A"},{"$f":"IF(Report2!G110=\"\",\"#N/A\",Report2!G110)","v":"#N/A"},{"$f":"IF(Report2!H110=\"\",DATE(1900,1,1),Report2!H110)","v":"1900-01-01"},{"$f":"IF(Report2!I110=\"\",0,Report2!I110)","v":0},"1900-01-01","1900-01-01",0,"1900-01-01","1900-01-01",0,{"$f":"IF(Report2!J110=\"\",\"#N/A\",Report2!J110)","v":"#N/A"}]
[{"$f":"IF(Report2!D111=\"\",0,Report2!D111)","v":0},{"$f":"IF(Report2!E111=\"\",\"#N/A\",Report2!E111)","v":"#N/A"},{"$f":"IF(Report2!F111=\"\",\"#N/A\",Report2!F111)","v":"#N/A"},{"$f":"IF(Report2!G111=\"\",\"#N/A\",Report2!G111)","v":"#N/A"},{"$f":"IF(Report2!H111=\"\",DATE(1900,1,1),Report2!H111)","v":"1900-01-01"},{"$f":"IF(Report2!I111=\"\",0,Report2!I111)","v":0},"1900-01-01","1900-01-01",0,"1900-01-01","1900-01-01",0,{"$f":"IF(Report2!J111=\"\",\"#N/A\",Report2!J111)","v":"#N/A"}]
[{"$f":"IF(Report2!D112=\"\",0,Report2!D112)","v":0},{"$f":"IF(Report2!E112=\"\",\"#N/A\",Report2!E112)","v":"#N/A"},{"$f":"IF(Report2!F112=\"\",\"#N/A\",Report2!F112)","v":"#N/A"},{"$f":"IF(Report2!G112=\"\",\"#N/A\",Report2!G112)","v":"#N/A"},{"$f":"IF(Report2!H112=\"\",DATE(1900,1,1),Report2!H112)","v":"1900-01-01"},{"$f":"IF(Report2!I112=\"\",0,Report2!I112)","v":0},"1900-01-01","1900-01-01",0,"1900-01-01","1900-01-01",0,{"$f":"IF(Report2!J112=\"\",\"#N/A\",Report2!J112)","v":"#N/A"}]
[{"$f":"IF(Report2!D113=\"\",0,Report2!D113)","v":0},{"$f":"IF(Report2!E113=\"\",\"#N/A\",Report2!E113)","v":"#N/A"},{"$f":"IF(Report2!F113=\"\",\"#N/A\",Report2!F113)","v":"#N/A"},{"$f":"IF(Report2!G113=\"\",\"#N/A\",Report2!G113)","v":"#N/A"},{"$f":"IF(Report2!H113=\"\",DATE(1900,1,1),Report2!H113)","v":"1900-01-01"},{"$f":"IF(Report2!I113=\"\",0,Report2!I113)","v":0},"1900-01-01","1900-01-01",0,"1900-01-01","1900-01-01",0,{"$f":"IF(Report2!J113=\"\",\"#N/A\",Report2!J113)","v":"#N/A"}]
[{"$f":"IF(Report2!D114=\"\",0,Report2!D114)","v":0},{"$f":"IF(Report2!E114=\"\",\"#N/A\",Report2!E114)","v":"#N/A"},{"$f":"IF(Report2!F114=\"\",\"#N/A\",Report2!F114)","v":"#N/A"},{"$f":"IF(Report2!G114=\"\",\"#N/A\",Report2!G114)","v":"#N/A"},{"$f":"IF(Report2!H114=\"\",DATE(1900,1,1),Report2!H114)","v":"1900-01-01"},{"$f":"IF(Report2!I114=\"\",0,Report2!I114)","v":0},"1900-01-01","1900-01-01",0,"1900-01-01","1900-01-01",0,{"$f":"IF(Report2!J114=\"\",\"#N/A\",Report2!J114)","v":"#N/A"}]
[{"$f":"IF(Report2!D115=\"\",0,Report2!D115)","v":0},{"$f":"IF(Report2!E115=\"\",\"#N/A\",Report2!E115)","v":"#N/A"},{"$f":"IF(Report2!F115=\"\",\"#N/A\",Report2!F115)","v":"#N/A"},{"$f":"IF(Report2!G115=\"\",\"#N/A\",Report2!G115)","v":"#N/A"},{"$f":"IF(Report2!H115=\"\",DATE(1900,1,1),Report2!H115)","v":"1900-01-01"},{"$f":"IF(Report2!I115=\"\",0,Report2!I115)","v":0},"1900-01-01","1900-01-01",0,"1900-01-01","1900-01-01",0,{"$f":"IF(Report2!J115=\"\",\"#N/A\",Report2!J115)","v":"#N/A"}]
[{"$f":"IF(Report2!D116=\"\",0,Report2!D116)","v":0},{"$f":"IF(Report2!E116=\"\",\"#N/A\",Report2!E116)","v":"#N/A"},{"$f":"IF(Report2!F116=\"\",\"#N/A\",Report2!F116)","v":"#N/A"},{"$f":"IF(Report2!G116=\"\",\"#N/A\",Report2!G116)","v":"#N/A"},{"$f":"IF(Report2!H116=\"\",DATE(1900,1,1),Report2!H116)","v":"1900-01-01"},{"$f":"IF(Report2!I116=\"\",0,Report2!I116)","v":0},"1900-01-01","1900-01-01",0,"1900-01-01","1900-01-01",0,{"$f":"IF(Report2!J116=\"\",\"#N/A\",Report2!J116)","v":"#N/A"}]
[{"$f":"IF(Report2!D117=\"\",0,Report2!D117)","v":0},{"$f":"IF(Report2!E117=\"\",\"#N/A\",Report2!E117)","v":"#N/A"},{"$f":"IF(Report2!F117=\"\",\"#N/A\",Report2!F117)","v":"#N/A"},{"$f":"IF(Report2!G117=\"\",\"#N/A\",Report2!G117)","v":"#N/A"},{"$f":"IF(Report2!H117=\"\",DATE(1900,1,1),Report2!H117)","v":"1900-01-01"},{"$f":"IF(Report2!I117=\"\",0,Report2!I117)","v":0},"1900-01-01","1900-01-01",0,"1900-01-01","1900-01-01",0,{"$f":"IF(Report2!J117=\"\",\"#N/A\",Report2!J117)","v":"#N/A"}]
[{"$f":"IF(Report2!D118=\"\",0,Report2!D118)","v":0},{"$f":"IF(Report2!E118=\"\",\"#N/A\",Report2!E118)","v":"#N/A"},{"$f":"IF(Report2!F118=\"\",\"#N/A\",Report2!F118)","v":"#N/A"},{"$f":"IF(Report2!G118=\"\",\"#N/A\",Report2!G118)","v":"#N/A"},{"$f":"IF(Report2!H118=\"\",DATE(1900,1,1),Report2!H118)","v":"1900-01-01"},{"$f":"IF(Report2!I118=\"\",0,Report2!I118)","v":0},"1900-01-01","1900-01-01",0,"1900-01-01","1900-01-01",0,{"$f":"IF(Report2!J118=\"\",\"#N/A\",Report2!J118)","v":"#N/A"}]
[{"$f":"IF(Report2!D119=\"\",0,Report2!D119)","v":0},{"$f":"IF(Report2!E119=\"\",\"#N/A\",Report2!E119)","v":"#N/A"},{"$f":"IF(Report2!F119=\"\",\"#N/A\",Report2!F119)","v":"#N/A"},{"$f":"IF(Report2!G119=\"\",\"#N/A\",Report2!G119)","v":"#N/A"},{"$f":"IF(Report2!H119=\"\",DATE(1900,1,1),Report2!H119)","v":"1900-01-01"},{"$f":"IF(Report2!I119=\"\",0,Report2!I119)","v":0},"1900-01-01","1900-01-01",0,"1900-01-01","1900-01-01",0,{"$f":"IF(Report2!J119=\"\",\"#N/A\",Report2!J119)","v":"#N/A"}]
[{"$f":"IF(Report2!D120=\"\",0,Report2!D120)","v":0},{"$f":"IF(Report2!E120=\"\",\"#N/A\",Report2!E120)","v":"#N/A"},{"$f":"IF(Report2!F120=\"\",\"#N/A\",Report2!F120)","v":"#N/A"},{"$f":"IF(Report2!G120=\"\",\"#N/A\",Report2!G120)","v":"#N/A"},{"$f":"IF(Report2!H120=\"\",DATE(1900,1,1),Report2!H120)","v":"1900-01-01"},{"$f":"IF(Report2!I120=\"\",0,Report2!I120)","v":0},{"$f":"DATE(1900,1,1)","v":"1900-01-01"},"1900-01-01",0,{"$f":"DATE(1900,1,1)","v":"1900-01-01"},"1900-01-01",0,{"$f":"IF(Report2!J120=\"\",\"#N/A\",Report2!J120)","v":"#N/A"}]
[{"$f":"IF(Report2!D121=\"\",0,Report2!D121)","v":0},{"$f":"IF(Report2!E121=\"\",\"#N/A\",Report2!E121)","v":"#N/A"},{"$f":"IF(Report2!F121=\"\",\"#N/A\",Report2!F121)","v":"#N/A"},{"$f":"IF(Report2!G121=\"\",\"#N/A\",Report2!G121)","v":"#N/A"},{"$f":"IF(Report2!H121=\"\",DATE(1900,1,1),Report2!H121)","v":"1900-01-01"},{"$f":"IF(Report2!I121=\"\",0,Report2!I121)","v":0},"1900-01-01","1900-01-01",0,"1900-01-01","1900-01-01",0,{"$f":"IF(Report2!J121=\"\",\"#N/A\",Report2!J121)","v":"#N/A"}]
[{"$f":"IF(Report2!D122=\"\",0,Report2!D122)","v":0},{"$f":"IF(Report2!E122=\"\",\"#N/A\",Report2!E122)","v":"#N/A"},{"$f":"IF(Report2!F122=\"\",\"#N/A\",Report2!F122)","v":"#N/A"},{"$f":"IF(Report2!G122=\"\",\"#N/A\",Report2!G122)","v":"#N/A"},{"$f":"IF(Report2!H122=\"\",DATE(1900,1,1),Report2!H122)","v":"1900-01-01"},{"$f":"IF(Report2!I122=\"\",0,Report2!I122)","v":0},"1900-01-01","1900-01-01",0,"1900-01-01","1900-01-01",0,{"$f":"IF(Report2!J122=\"\",\"#N/A\",Report2!J122)","v":"#N/A"}]
[{"$f":"IF(Report2!D123=\"\",0,Report2!D123)","v":0},{"$f":"IF(Report2!E123=\"\",\"#N/A\",Report2!E123)","v":"#N/A"},{"$f":"IF(Report2!F123=\"\",\"#N/A\",Report2!F123)","v":"#N/A"},{"$f":"IF(Report2!G123=\"\",\"#N/A\",Report2!G123)","v":"#N/A"},{"$f":"IF(Report2!H123=\"\",DATE(1900,1,1),Report2!H123)","v":"1900-01-01"},{"$f":"IF(Report2!I123=\"\",0,Report2!I123)","v":0},"1900-01-01","1900-01-01",0,"1900-01-01","1900-01-01",0,{"$f":"IF(Report2!J123=\"\",\"#N/A\",Report2!J123)","v":"#N/A"}]
[{"$f":"IF(Report2!D124=\"\",0,Report2!D124)","v":0},{"$f":"IF(Report2!E124=\"\",\"#N/A\",Report2!E124)","v":"#N/A"},{"$f":"IF(Report2!F124=\"\",\"#N/A\",Report2!F124)","v":"#N/A"},{"$f":"IF(Report2!G124=\"\",\"#N/A\",Report2!G124)","v":"#N/A"},{"$f":"IF(Report2!H124=\"\",DATE(1900,1,1),Report2!H124)","v":"1900-01-01"},{"$f":"IF(Report2!I124=\"\",0,Report2!I124)","v":0},"1900-01-01","1900-01-01",0,"1900-01-01","1900-01-01",0,{"$f":"IF(Report2!J124=\"\",\"#N/A\",Report2!J124)","v":"#N/A"}]
[{"$f":"IF(Report2!D125=\"\",0,Report2!D125)","v":0},{"$f":"IF(Report2!E125=\"\",\"#N/A\",Report2!E125)","v":"#N/A"},{"$f":"IF(Report2!F125=\"\",\"#N/A\",Report2!F125)","v":"#N/A"},{"$f":"IF(Report2!G125=\"\",\"#N/A\",Report2!G125)","v":"#N/A"},{"$f":"IF(Report2!H125=\"\",DATE(1900,1,1),Report2!H125)","v":"1900-01-01"},{"$f":"IF(Report2!I125=\"\",0,Report2!I125)","v":0},"1900-01-01","1900-01-01",0,"1900-01-01","1900-01-01",0,{"$f":"IF(Report2!J125=\"\",\"#N/A\",Report2!J125)","v":"#N/A"}]
[{"$f":"IF(Report2!D126=\"\",0,Report2!D126)","v":0},{"$f":"IF(Report2!E126=\"\",\"#N/A\",Report2!E126)","v":"#N/A"},{"$f":"IF(Report2!F126=\"\",\"#N/A\",Report2!F126)","v":"#N/A"},{"$f":"IF(Report2!G126=\"\",\"#N/A\",Report2!G126)","v":"#N/A"},{"$f":"IF(Report2!H126=\"\",DATE(1900,1,1),Report2!H126)","v":"1900-01-01"},{"$f":"IF(Report2!I126=\"\",0,Report2!I126)","v":0},"1900-01-01","1900-01-01",0,"1900-01-01","1900-01-01",0,{"$f":"IF(Report2!J126=\"\",\"#N/A\",Report2!J126)","v":"#N/A"}]
[{"$f":"IF(Report2!D127=\"\",0,Report2!D127)","v":0},{"$f":"IF(Report2!E127=\"\",\"#N/A\",Report2!E127)","v":"#N/A"},{"$f":"IF(Report2!F127=\"\",\"#N/A\",Report2!F127)","v":"#N/A"},{"$f":"IF(Report2!G127=\"\",\"#N/A\",Report2!G127)","v":"#N/A"},{"$f":"IF(Report2!H127=\"\",DATE(1900,1,1),Report2!H127)","v":"1900-01-01"},{"$f":"IF(Report2!I127=\"\",0,Report2!I127)","v":0},"1900-01-01","1900-01-01",0,"1900-01-01","1900-01-01",0,{"$f":"IF(Report2!J127=\"\",\"#N/A\",Report2!J127)","v":"#N/A"}]
[{"$f":"IF(Report2!D128=\"\",0,Report2!D128)","v":0},{"$f":"IF(Report2!E128=\"\",\"#N/A\",Report2!E128)","v":"#N/A"},{"$f":"IF(Report2!F128=\"\",\"#N/A\",Report2!F128)","v":"#N/A"},{"$f":"IF(Report2!G128=\"\",\"#N/A\",Report2!G128)","v":"#N/A"},{"$f":"IF(Report2!H128=\"\",DATE(1900,1,1),Report2!H128)","v":"1900-01-01"},{"$f":"IF(Report2!I128=\"\",0,Report2!I128)","v":0},"1900-01-01","1900-01-01",0,"1900-01-01","1900-01-01",0,{"$f":"IF(Report2!J128=\"\",\"#N/A\",Report2!J128)","v":"#N/A"}]
[{"$f":"IF(Report2!D129=\"\",0,Report2!D129)","v":0},{"$f":"IF(Report2!E129=\"\",\"#N/A\",Report2!E129)","v":"#N/A"},{"$f":"IF(Report2!F129=\"\",\"#N/A\",Report2!F129)","v":"#N/A"},{"$f":"IF(Report2!G129=\"\",\"#N/A\",Report2!G129)","v":"#N/A"},{"$f":"IF(Report2!H129=\"\",DATE(1900,1,1),Report2!H129)","v":"1900-01-01"},{"$f":"IF(Report2!I129=\"\",0,Report2!I129)","v":0},"1900-01-01","1900-01-01",0,"1900-01-01","1900-01-01",0,{"$f":"IF(Report2!J129=\"\",\"#N/A\",Report2!J129)","v":"#N/A"}]
[{"$f":"IF(Report2!D130=\"\",0,Report2!D130)","v":0},{"$f":"IF(Report2!E130=\"\",\"#N/A\",Report2!E130)","v":"#N/A"},{"$f":"IF(Report2!F130=\"\",\"#N/A\",Report2!F130)","v":"#N/A"},{"$f":"IF(Report2!G130=\"\",\"#N/A\",Report2!G130)","v":"#N/A"},{"$f":"IF(Report2!H130=\"\",DATE(1900,1,1),Report2!H130)","v":"1900-01-01"},{"$f":"IF(Report2!I130=\"\",0,Report2!I130)","v":0},"1900-01-01","1900-01-01",0,"1900-01-01","1900-01-01",0,{"$f":"IF(Report2!J130=\"\",\"#N/A\",Report2!J130)","v":"#N/A"}]
[{"$f":"IF(Report2!D131=\"\",0,Report2!D131)","v":0},{"$f":"IF(Report2!E131=\"\",\"#N/A\",Report2!E131)","v":"#N/A"},{"$f":"IF(Report2!F131=\"\",\"#N/A\",Report2!F131)","v":"#N/A"},{"$f":"IF(Report2!G131=\"\",\"#N/A\",Report2!G131)","v":"#N/A"},{"$f":"IF(Report2!H131=\"\",DATE(1900,1,1),Report2!H131)","v":"1900-01-01"},{"$f":"IF(Report2!I131=\"\",0,Report2!I131)","v":0},"1900-01-01","1900-01-01",0,"1900-01-01","1900-01-01",0,{"$f":"IF(Report2!J131=\"\",\"#N/A\",Report2!J131)","v":"#N/A"}]
[{"$f":"IF(Report2!D132=\"\",0,Report2!D132)","v":0},{"$f":"IF(Report2!E132=\"\",\"#N/A\",Report2!E132)","v":"#N/A"},{"$f":"IF(Report2!F132=\"\",\"#N/A\",Report2!F132)","v":"#N/A"},{"$f":"IF(Report2!G132=\"\",\"#N/A\",Report2!G132)","v":"#N/A"},{"$f":"IF(Report2!H132=\"\",DATE(1900,1,1),Report2!H132)","v":"1900-01-01"},{"$f":"IF(Report2!I132=\"\",0,Report2!I132)","v":0},"1900-01-01","1900-01-01",0,"1900-01-01","1900-01-01",0,{"$f":"IF(Report2!J132=\"\",\"#N/A\",Report2!J132)","v":"#N/A"}]
[{"$f":"IF(Report2!D133=\"\",0,Report2!D133)","v":0},{"$f":"IF(Report2!E133=\"\",\"#N/A\",Report2!E133)","v":"#N/A"},{"$f":"IF(Report2!F133=\"\",\"#N/A\",Report2!F133)","v":"#N/A"},{"$f":"IF(Report2!G133=\"\",\"#N/A\",Report2!G133)","v":"#N/A"},{"$f":"IF(Report2!H133=\"\",DATE(1900,1,1),Report2!H133)","v":"1900-01-01"},{"$f":"IF(Report2!I133=\"\",0,Report2!I133)","v":0},"1900-01-01","1900-01-01",0,"1900-01-01","1900-01-01",0,{"$f":"IF(Report2!J133=\"\",\"#N/A\",Report2!J133)","v":"#N/A"}]
[{"$f":"IF(Report2!D134=\"\",0,Report2!D134)","v":0},{"$f":"IF(Report2!E134=\"\",\"#N/A\",Report2!E134)","v":"#N/A"},{"$f":"IF(Report2!F134=\"\",\"#N/A\",Report2!F134)","v":"#N/A"},{"$f":"IF(Report2!G134=\"\",\"#N/A\",Report2!G134)","v":"#N/A"},{"$f":"IF(Report2!H134=\"\",DATE(1900,1,1),Report2!H134)","v":"1900-01-01"},{"$f":"IF(Report2!I134=\"\",0,Report2!I134)","v":0},"1900-01-01","1900-01-01",0,"1900-01-01","1900-01-01",0,{"$f":"IF(Report2!J134=\"\",\"#N/A\",Report2!J134)","v":"#N/A"}]
[{"$f":"IF(Report2!D135=\"\",0,Report2!D135)","v":0},{"$f":"IF(Report2!E135=\"\",\"#N/A\",Report2!E135)","v":"#N/A"},{"$f":"IF(Report2!F135=\"\",\"#N/A\",Report2!F135)","v":"#N/A"},{"$f":"IF(Report2!G135=\"\",\"#N/A\",Report2!G135)","v":"#N/A"},{"$f":"IF(Report2!H135=\"\",DATE(1900,1,1),Report2!H135)","v":"1900-01-01"},{"$f":"IF(Report2!I135=\"\",0,Report2!I135)","v":0},"1900-01-01","1900-01-01",0,"1900-01-01","1900-01-01",0,{"$f":"IF(Report2!J135=\"\",\"#N/A\",Report2!J135)","v":"#N/A"}]
[{"$f":"IF(Report2!D136=\"\",0,Report2!D136)","v":0},{"$f":"IF(Report2!E136=\"\",\"#N/A\",Report2!E136)","v":"#N/A"},{"$f":"IF(Report2!F136=\"\",\"#N/A\",Report2!F136)","v":"#N/A"},{"$f":"IF(Report2!G136=\"\",\"#N/A\",Report2!G136)","v":"#N/A"},{"$f":"IF(Report2!H136=\"\",DATE(1900,1,1),Report2!H136)","v":"1900-01-01"},{"$f":"IF(Report2!I136=\"\",0,Report2!I136)","v":0},"1900-01-01","1900-01-01",0,"1900-01-01","1900-01-01",0,{"$f":"IF(Report2!J136=\"\",\"#N/A\",Report2!J136)","v":"#N/A"}]
[{"$f":"IF(Report2!D137=\"\",0,Report2!D137)","v":0},{"$f":"IF(Report2!E137=\"\",\"#N/A\",Report2!E137)","v":"#N/A"},{"$f":"IF(Report2!F137=\"\",\"#N/A\",Report2!F137)","v":"#N/A"},{"$f":"IF(Report2!G137=\"\",\"#N/A\",Report2!G137)","v":"#N/A"},{"$f":"IF(Report2!H137=\"\",DATE(1900,1,1),Report2!H137)","v":"1900-01-01"},{"$f":"IF(Report2!I137=\"\",0,Report2!I137)","v":0},"1900-01-01","1900-01-01",0,"1900-01-01","1900-01-01",0,{"$f":"IF(Report2!J137=\"\",\"#N/A\",Report2!J137)","v":"#N/A"}]
[{"$f":"IF(Report2!D138=\"\",0,Report2!D138)","v":0},{"$f":"IF(Report2!E138=\"\",\"#N/A\",Report2!E138)","v":"#N/A"},{"$f":"IF(Report2!F138=\"\",\"#N/A\",Report2!F138)","v":"#N/A"},{"$f":"IF(Report2!G138=\"\",\"#N/A\",Report2!G138)","v":"#N/A"},{"$f":"IF(Report2!H138=\"\",DATE(1900,1,1),Report2!H138)","v":"1900-01-01"},{"$f":"IF(Report2!I138=\"\",0,Report2!I138)","v":0},"1900-01-01","1900-01-01",0,"1900-01-01","1900-01-01",0,{"$f":"IF(Report2!J138=\"\",\"#N/A\",Report2!J138)","v":"#N/A"}]
[{"$f":"IF(Report2!D139=\"\",0,Report2!D139)","v":0},{"$f":"IF(Report2!E139=\"\",\"#N/A\",Report2!E139)","v":"#N/A"},{"$f":"IF(Report2!F139=\"\",\"#N/A\",Report2!F139)","v":"#N/A"},{"$f":"IF(Report2!G139=\"\",\"#N/A\",Report2!G139)","v":"#N/A"},{"$f":"IF(Report2!H139=\"\",DATE(1900,1,1),Report2!H139)","v":"1900-01-01"},{"$f":"IF(Report2!I139=\"\",0,Report2!I139)","v":0},"1900-01-01","1900-01-01",0,"1900-01-01","1900-01-01",0,{"$f":"IF(Report2!J139=\"\",\"#N/A\",Report2!J139)","v":"#N/A"}]
[{"$f":"IF(Report2!D140=\"\",0,Report2!D140)","v":0},{"$f":"IF(Report2!E140=\"\",\"#N/A\",Report2!E140)","v":"#N/A"},{"$f":"IF(Report2!F140=\"\",\"#N/A\",Report2!F140)","v":"#N/A"},{"$f":"IF(Report2!G140=\"\",\"#N/A\",Report2!G140)","v":"#N/A"},{"$f":"IF(Report2!H140=\"\",DATE(1900,1,1),Report2!H140)","v":"1900-01-01"},{"$f":"IF(Report2!I140=\"\",0,Report2!I140)","v":0},"1900-01-01","1900-01-01",0,"1900-01-01","1900-01-01",0,{"$f":"IF(Report2!J140=\"\",\"#N/A\",Report2!J140)","v":"#N/A"}]
[{"$f":"IF(Report2!D141=\"\",0,Report2!D141)","v":0},{"$f":"IF(Report2!E141=\"\",\"#N/A\",Report2!E141)","v":"#N/A"},{"$f":"IF(Report2!F141=\"\",\"#N/A\",Report2!F141)","v":"#N/A"},{"$f":"IF(Report2!G141=\"\",\"#N/A\",Report2!G141)","v":"#N/A"},{"$f":"IF(Report2!H141=\"\",DATE(1900,1,1),Report2!H141)","v":"1900-01-01"},{"$f":"IF(Report2!I141=\"\",0,Report2!I141)","v":0},"1900-01-01","1900-01-01",0,"1900-01-01","1900-01-01",0,{"$f":"IF(Report2!J141=\"\",\"#N/A\",Report2!J141)","v":"#N/A"}]
[{"$f":"IF(Report2!D142=\"\",0,Report2!D142)","v":0},{"$f":"IF(Report2!E142=\"\",\"#N/A\",Report2!E142)","v":"#N/A"},{"$f":"IF(Report2!F142=\"\",\"#N/A\",Report2!F142)","v":"#N/A"},{"$f":"IF(Report2!G142=\"\",\"#N/A\",Report2!G142)","v":"#N/A"},{"$f":"IF(Report2!H142=\"\",DATE(1900,1,1),Report2!H142)","v":"1900-01-01"},{"$f":"IF(Report2!I142=\"\",0,Report2!I142)","v":0},"1900-01-01","1900-01-01",0,"1900-01-01","1900-01-01",0,{"$f":"IF(Report2!J142=\"\",\"#N/A\",Report2!J142)","v":"#N/A"}]
[{"$f":"IF(Report2!D143=\"\",0,Report2!D143)","v":0},{"$f":"IF(Report2!E143=\"\",\"#N/A\",Report2!E143)","v":"#N/A"},{"$f":"IF(Report2!F143=\"\",\"#N/A\",Report2!F143)","v":"#N/A"},{"$f":"IF(Report2!G143=\"\",\"#N/A\",Report2!G143)","v":"#N/A"},{"$f":"IF(Report2!H143=\"\",DATE(1900,1,1),Report2!H143)","v":"1900-01-01"},{"$f":"IF(Report2!I143=\"\",0,Report2!I143)","v":0},"1900-01-01","1900-01-01",0,"1900-01-01","1900-01-01",0,{"$f":"IF(Report2!J143=\"\",\"#N/A\",Report2!J143)","v":"#N/A"}]
[{"$f":"IF(Report2!D144=\"\",0,Report2!D144)","v":0},{"$f":"IF(Report2!E144=\"\",\"#N/A\",Report2!E144)","v":"#N/A"},{"$f":"IF(Report2!F144=\"\",\"#N/A\",Report2!F144)","v":"#N/A"},{"$f":"IF(Report2!G144=\"\",\"#N/A\",Report2!G144)","v":"#N/A"},{"$f":"IF(Report2!H144=\"\",DATE(1900,1,1),Report2!H144)","v":"1900-01-01"},{"$f":"IF(Report2!I144=\"\",0,Report2!I144)","v":0},"1900-01-01","1900-01-01",0,"1900-01-01","1900-01-01",0,{"$f":"IF(Report2!J144=\"\",\"#N/A\",Report2!J144)","v":"#N/A"}]
[{"$f":"IF(Report2!D145=\"\",0,Report2!D145)","v":0},{"$f":"IF(Report2!E145=\"\",\"#N/A\",Report2!E145)","v":"#N/A"},{"$f":"IF(Report2!F145=\"\",\"#N/A\",Report2!F145)","v":"#N/A"},{"$f":"IF(Report2!G145=\"\",\"#N/A\",Report2!G145)","v":"#N/A"},{"$f":"IF(Report2!H145=\"\",DATE(1900,1,1),Report2!H145)","v":"1900-01-01"},{"$f":"IF(Report2!I145=\"\",0,Report2!I145)","v":0},"1900-01-01","1900-01-01",0,"1900-01-01","1900-01-01",0,{"$f":"IF(Report2!J145=\"\",\"#N/A\",Report2!J145)","v":"#N/A"}]
[{"$f":"IF(Report2!D146=\"\",0,Report2!D146)","v":0},{"$f":"IF(Report2!E146=\"\",\"#N/A\",Report2!E146)","v":"#N/A"},{"$f":"IF(Report2!F146=\"\",\"#N/A\",Report2!F146)","v":"#N/A"},{"$f":"IF(Report2!G146=\"\",\"#N/A\",Report2!G146)","v":"#N/A"},{"$f":"IF(Report2!H146=\"\",DATE(1900,1,1),Report2!H146)","v":"1900-01-01"},{"$f":"IF(Report2!I146=\"\",0,Report2!I146)","v":0},"1900-01-01","1900-01-01",0,"1900-01-01","1900-01-01",0,{"$f":"IF(Report2!J146=\"\",\"#N/A\",Report2!J146)","v":"#N/A"}]
[{"$f":"IF(Report2!D147=\"\",0,Report2!D147)","v":0},{"$f":"IF(Report2!E147=\"\",\"#N/A\",Report2!E147)","v":"#N/A"},{"$f":"IF(Report2!F147=\"\",\"#N/A\",Report2!F147)","v":"#N/A"},{"$f":"IF(Report2!G147=\"\",\"#N/A\",Report2!G147)","v":"#N/A"},{"$f":"IF(Report2!H147=\"\",DATE(1900,1,1),Report2!H147)","v":"1900-01-01"},{"$f":"IF(Report2!I147=\"\",0,Report2!I147)","v":0},"1900-01-01","1900-01-01",0,"1900-01-01","1900-01-01",0,{"$f":"IF(Report2!J147=\"\",\"#N/A\",Report2!J147)","v":"#N/A"}]
[{"$f":"IF(Report2!D148=\"\",0,Report2!D148)","v":0},{"$f":"IF(Report2!E148=\"\",\"#N/A\",Report2!E148)","v":"#N/A"},{"$f":"IF(Report2!F148=\"\",\"#N/A\",Report2!F148)","v":"#N/A"},{"$f":"IF(Report2!G148=\"\",\"#N/A\",Report2!G148)","v":"#N/A"},{"$f":"IF(Report2!H148=\"\",DATE(1900,1,1),Report2!H148)","v":"1900-01-01"},{"$f":"IF(Report2!I148=\"\",0,Report2!I148)","v":0},"1900-01-01","1900-01-01",0,"1900-01-01","1900-01-01",0,{"$f":"IF(Report2!J148=\"\",\"#N/A\",Report2!J148)","v":"#N/A"}]
[{"$f":"IF(Report2!D149=\"\",0,Report2!D149)","v":0},{"$f":"IF(Report2!E149=\"\",\"#N/A\",Report2!E149)","v":"#N/A"},{"$f":"IF(Report2!F149=\"\",\"#N/A\",Report2!F149)","v":"#N/A"},{"$f":"IF(Report2!G149=\"\",\"#N/A\",Report2!G149)","v":"#N/A"},{"$f":"IF(Report2!H149=\"\",DATE(1900,1,1),Report2!H149)","v":"1900-01-01"},{"$f":"IF(Report2!I149=\"\",0,Report2!I149)","v":0},"1900-01-01","1900-01-01",0,"1900-01-01","1900-01-01",0,{"$f":"IF(Report2!J149=\"\",\"#N/A\",Report2!J149)","v":"#N/A"}]
[{"$f":"IF(Report2!D150=\"\",0,Report2!D150)","v":0},{"$f":"IF(Report2!E150=\"\",\"#N/A\",Report2!E150)","v":"#N/A"},{"$f":"IF(Report2!F150=\"\",\"#N/A\",Report2!F150)","v":"#N/A"},{"$f":"IF(Report2!G150=\"\",\"#N/A\",Report2!G150)","v":"#N/A"},{"$f":"IF(Report2!H150=\"\",DATE(1900,1,1),Report2!H150)","v":"1900-01-01"},{"$f":"IF(Report2!I150=\"\",0,Report2!I150)","v":0},"1900-01-01","1900-01-01",0,"1900-01-01","1900-01-01",0,{"$f":"IF(Report2!J150=\"\",\"#N/A\",Report2!J150)","v":"#N/A"}]
[{"$f":"IF(Report2!D151=\"\",0,Report2!D151)","v":0},{"$f":"IF(Report2!E151=\"\",\"#N/A\",Report2!E151)","v":"#N/A"},{"$f":"IF(Report2!F151=\"\",\"#N/A\",Report2!F151)","v":"#N/A"},{"$f":"IF(Report2!G151=\"\",\"#N/A\",Report2!G151)","v":"#N/A"},{"$f":"IF(Report2!H151=\"\",DATE(1900,1,1),Report2!H151)","v":"1900-01-01"},{"$f":"IF(Report2!I151=\"\",0,Report2!I151)","v":0},"1900-01-01","1900-01-01",0,"1900-01-01","1900-01-01",0,{"$f":"IF(Report2!J151=\"\",\"#N/A\",Report2!J151)","v":"#N/A"}]
[{"$f":"IF(Report2!D152=\"\",0,Report2!D152)","v":0},{"$f":"IF(Report2!E152=\"\",\"#N/A\",Report2!E152)","v":"#N/A"},{"$f":"IF(Report2!F152=\"\",\"#N/A\",Report2!F152)","v":"#N/A"},{"$f":"IF(Report2!G152=\"\",\"#N/A\",Report2!G152)","v":"#N/A"},{"$f":"IF(Report2!H152=\"\",DATE(1900,1,1),Report2!H152)","v":"1900-01-01"},{"$f":"IF(Report2!I152=\"\",0,Report2!I152)","v":0},"1900-01-01","1900-01-01",0,"1900-01-01","1900-01-01",0,{"$f":"IF(Report2!J152=\"\",\"#N/A\",Report2!J152)","v":"#N/A"}]
[{"$f":"IF(Report2!D153=\"\",0,Report2!D153)","v":0},{"$f":"IF(Report2!E153=\"\",\"#N/A\",Report2!E153)","v":"#N/A"},{"$f":"IF(Report2!F153=\"\",\"#N/A\",Report2!F153)","v":"#N/A"},{"$f":"IF(Report2!G153=\"\",\"#N/A\",Report2!G153)","v":"#N/A"},{"$f":"IF(Report2!H153=\"\",DATE(1900,1,1),Report2!H153)","v":"1900-01-01"},{"$f":"IF(Report2!I153=\"\",0,Report2!I153)","v":0},"1900-01-01","1900-01-01",0,"1900-01-01","1900-01-01",0,{"$f":"IF(Report2!J153=\"\",\"#N/A\",Report2!J153)","v":"#N/A"}]
[{"$f":"IF(Report2!D154=\"\",0,Report2!D154)","v":0},{"$f":"IF(Report2!E154=\"\",\"#N/A\",Report2!E154)","v":"#N/A"},{"$f":"IF(Report2!F154=\"\",\"#N/A\",Report2!F154)","v":"#N/A"},{"$f":"IF(Report2!G154=\"\",\"#N/A\",Report2!G154)","v":"#N/A"},{"$f":"IF(Report2!H154=\"\",DATE(1900,1,1),Report2!H154)","v":"1900-01-01"},{"$f":"IF(Report2!I154=\"\",0,Report2!I154)","v":0},"1900-01-01","1900-01-01",0,"1900-01-01","1900-01-01",0,{"$f":"IF(Report2!J154=\"\",\"#N/A\",Report2!J154)","v":"#N/A"}]
[{"$f":"IF(Report2!D155=\"\",0,Report2!D155)","v":0},{"$f":"IF(Report2!E155=\"\",\"#N/A\",Report2!E155)","v":"#N/A"},{"$f":"IF(Report2!F155=\"\",\"#N/A\",Report2!F155)","v":"#N/A"},{"$f":"IF(Report2!G155=\"\",\"#N/A\",Report2!G155)","v":"#N/A"},{"$f":"IF(Report2!H155=\"\",DATE(1900,1,1),Report2!H155)","v":"1900-01-01"},{"$f":"IF(Report2!I155=\"\",0,Report2!I155)","v":0},"1900-01-01","1900-01-01",0,"1900-01-01","1900-01-01",0,{"$f":"IF(Report2!J155=\"\",\"#N/A\",Report2!J155)","v":"#N/A"}]
[{"$f":"IF(Report2!D156=\"\",0,Report2!D156)","v":0},{"$f":"IF(Report2!E156=\"\",\"#N/A\",Report2!E156)","v":"#N/A"},{"$f":"IF(Report2!F156=\"\",\"#N/A\",Report2!F156)","v":"#N/A"},{"$f":"IF(Report2!G156=\"\",\"#N/A\",Report2!G156)","v":"#N/A"},{"$f":"IF(Report2!H156=\"\",DATE(1900,1,1),Report2!H156)","v":"1900-01-01"},{"$f":"IF(Report2!I156=\"\",0,Report2!I156)","v":0},"1900-01-01","1900-01-01",0,"1900-01-01","1900-01-01",0,{"$f":"IF(Report2!J156=\"\",\"#N/A\",Report2!J156)","v":"#N/A"}]
[{"$f":"IF(Report2!D157=\"\",0,Report2!D157)","v":0},{"$f":"IF(Report2!E157=\"\",\"#N/A\",Report2!E157)","v":"#N/A"},{"$f":"IF(Report2!F157=\"\",\"#N/A\",Report2!F157)","v":"#N/A"},{"$f":"IF(Report2!G157=\"\",\"#N/A\",Report2!G157)","v":"#N/A"},{"$f":"IF(Report2!H157=\"\",DATE(1900,1,1),Report2!H157)","v":"1900-01-01"},{"$f":"IF(Report2!I157=\"\",0,Report2!I157)","v":0},"1900-01-01","1900-01-01",0,"1900-01-01","1900-01-01",0,{"$f":"IF(Report2!J157=\"\",\"#N/A\",Report2!J157)","v":"#N/A"}]
[{"$f":"IF(Report2!D158=\"\",0,Report2!D158)","v":0},{"$f":"IF(Report2!E158=\"\",\"#N/A\",Report2!E158)","v":"#N/A"},{"$f":"IF(Report2!F158=\"\",\"#N/A\",Report2!F158)","v":"#N/A"},{"$f":"IF(Report2!G158=\"\",\"#N/A\",Report2!G158)","v":"#N/A"},{"$f":"IF(Report2!H158=\"\",DATE(1900,1,1),Report2!H158)","v":"1900-01-01"},{"$f":"IF(Report2!I158=\"\",0,Report2!I158)","v":0},"1900-01-01","1900-01-01",0,"1900-01-01","1900-01-01",0,{"$f":"IF(Report2!J158=\"\",\"#N/A\",Report2!J158)","v":"#N/A"}]
[{"$f":"IF(Report2!D159=\"\",0,Report2!D159)","v":0},{"$f":"IF(Report2!E159=\"\",\"#N/A\",Report2!E159)","v":"#N/A"},{"$f":"IF(Report2!F159=\"\",\"#N/A\",Report2!F159)","v":"#N/A"},{"$f":"IF(Report2!G159=\"\",\"#N/A\",Report2!G159)","v":"#N/A"},{"$f":"IF(Report2!H159=\"\",DATE(1900,1,1),Report2!H159)","v":"1900-01-01"},{"$f":"IF(Report2!I159=\"\",0,Report2!I159)","v":0},"1900-01-01","1900-01-01",0,"1900-01-01","1900-01-01",0,{"$f":"IF(Report2!J159=\"\",\"#N/A\",Report2!J159)","v":"#N/A"}]
[{"$f":"IF(Report2!D160=\"\",0,Report2!D160)","v":0},{"$f":"IF(Report2!E160=\"\",\"#N/A\",Report2!E160)","v":"#N/A"},{"$f":"IF(Report2!F160=\"\",\"#N/A\",Report2!F160)","v":"#N/A"},{"$f":"IF(Report2!G160=\"\",\"#N/A\",Report2!G160)","v":"#N/A"},{"$f":"IF(Report2!H160=\"\",DATE(1900,1,1),Report2!H160)","v":"1900-01-01"},{"$f":"IF(Report2!I160=\"\",0,Report2!I160)","v":0},"1900-01-01","1900-01-01",0,"1900-01-01","1900-01-01",0,{"$f":"IF(Report2!J160=\"\",\"#N/A\",Report2!J160)","v":"#N/A"}]
[{"$f":"IF(Report2!D161=\"\",0,Report2!D161)","v":0},{"$f":"IF(Report2!E161=\"\",\"#N/A\",Report2!E161)","v":"#N/A"},{"$f":"IF(Report2!F161=\"\",\"#N/A\",Report2!F161)","v":"#N/A"},{"$f":"IF(Report2!G161=\"\",\"#N/A\",Report2!G161)","v":"#N/A"},{"$f":"IF(Report2!H161=\"\",DATE(1900,1,1),Report2!H161)","v":"1900-01-01"},{"$f":"IF(Report2!I161=\"\",0,Report2!I161)","v":0},"1900-01-01","1900-01-01",0,"1900-01-01","1900-01-01",0,{"$f":"IF(Report2!J161=\"\",\"#N/A\",Report2!J161)","v":"#N/A"}]
[{"$f":"IF(Report2!D162=\"\",0,Report2!D162)","v":0},{"$f":"IF(Report2!E162=\"\",\"#N/A\",Report2!E162)","v":"#N/A"},{"$f":"IF(Report2!F162=\"\",\"#N/A\",Report2!F162)","v":"#N/A"},{"$f":"IF(Report2!G162=\"\",\"#N/A\",Report2!G162)","v":"#N/A"},{"$f":"IF(Report2!H162=\"\",DATE(1900,1,1),Report2!H162)","v":"1900-01-01"},{"$f":"IF(Report2!I162=\"\",0,Report2!I162)","v":0},"1900-01-01","1900-01-01",0,"1900-01-01","1900-01-01",0,{"$f":"IF(Report2!J162=\"\",\"#N/A\",Report2!J162)","v":"#N/A"}]

{"sheet":"Language","index":2,"n_rows":85,"n_cols":7,"rows_kept":85,"cut":false,"hidden":true,"merged":[[1,0,1,5]]}
["Setup of file language (list must always be sorted by TextID)"]
["This list must always be sorted by TextID. If you add new columns to the list then please make sure that these new columns are included in the named are \"TextID\" (select Define Name from the Edit menu). Do not insert new rows on this sheet."]
[]
["Language column:","F",{"$f":"VLOOKUP(98,TextID,CODE(B4)-64)","v":"DE - 1010"}]
[]
[null,null,null,null,2000,1010,1080]
["TextID","Active","Sheet","Remark","EN","DE","IT"]
[98,"X","System","Language check","EN - 2000","DE - 1010","IT - 1080"]
[100,"X","System","Filename","VELUXstock_","VELUXlager_","Stock (magazzino) VELUX_"]
[102,null,"System","Material type","Standard","Standard","Standard"]
[104,null,"System","Material type","Roller shutter","Rollläden","persiane"]
[106,null,"System","Material UM","Pcs","Stück","pezzi"]
[108,"X","Contact","Button"," Customer master data (1)"," Kundenstammdaten (1)"," Dati del cliente (1)"]
[110,"X","Contact","Button"," Roof windows (2)"," Fenster (2)"," finestre (2)"]
[112,"X","Contact","Button"," Roller shutters (3)"," Rollläden (3)"," persiane (3)"]
[116,"X","Contact","Button"," Save as... (4)"," Speichern unter... (4)"," salva come... (4)"]
[118,"X","Contact","Button"," More information... "," Weitere Informationen..."," ulteriori informazioni"]
[120,"X","Contact","Button"," Contact VELUX... "," VELUX Kontakt..."," Contatti VELUX"]
[122,"X","Contact","Title","Contact VELUX","VELUX Kontakt","Contatti VELUX"]
[124,null,"Contact","Text","Customer service telephone number","Händler Service-Nummer","Numero per servizio al cliente"]
[126,null,"Contact","Text","E-mail","E-mail","E-mail"]
[128,null,"Contact","Text","Homepage","Homepage","Homepage"]
[130,null,"Contact","E-mail subject","[VELUX stock report]","[VELUX Lagerbestandsmeldungen]","report sulle scorte VELUX di magazzino "]
[131,"X","Information","Title","More Information","Weitere Informationen","Ulteriori informazioni"]
[132,"X","Customer","Title","Customer master data","Kundenstammdaten","Dati del cliente"]
[134,"X","Customer","Text","* Mandatory","* Eingabe erforderlich","* Campi obbligatori"]
[136,"X","Customer","Field name","* Customer number","* Kundennummer","* Codice cliente"]
[138,"X","Customer","Field name","* Company name","* Firmenname","* Ragione sociale"]
[140,"X","Customer","Field name","* Street","* Strasse","* Via"]
[142,"X","Customer","Field name","* Postal code","* Postleitzahl","* CAP"]
[144,"X","Customer","Field name","* City name","* Ort","* Località"]
[146,"X","Customer","Field name","* Contact person","* Name Bearbeiter","* Nome dell'addetto"]
[148,"X","Customer","Field name","Telephone","Telefon","Telefono"]
[150,"X","Customer","Field name","E-mail","E-mail","E-mail"]
[152,"X","Customer","Field help","Please enter you VELUX customer number here","Tragen Sie hier bitte Ihre VELUX Kundennummer ein","Inserire qui il codice cliente"]
[154,"X","Customer","Field help","Please enter your company name here","Tragen Sie hier bitte Ihren Firmennamen ein","Inserire qui la ragione sociale"]
[156,"X","Customer","Field help","Please enter your street name here","Tragen Sie hier bitte Ihre Strasse ein","Inserire qui l'indirizzo"]
[158,"X","Customer","Field help","Please enter your postal code here","Tragen Sie hier bitte Ihre Postleitzahl ein","Inserire qui il CAP"]
[160,"X","Customer","Field help","Please enter your city name here","Tragen Sie hier bitte Ihren Ort ein","Inserire qui la località"]
[162,"X","Customer","Field help","Please enter your first and last name here","Tragen Sie hier bitte Ihren Vor- und Nachnamen ein","Inserire qui nome e cognome"]
[164,"X","Customer","Field help","Please enter your telephone number here","Tragen Sie hier bitte die Telefonnummer ein, unter der Sie für Rückfragen erreichbar sind","Inserire qui il numero di telefono cui contattarLa in caso di eventuali richieste"]
[166,"X","Customer","Field help","Please enter your e-mail address here","Tragen Sie hier bitte die E-Mailadresse ein, unter der Sie für Rückfragen erreichbar sind","Inserire qui l'indirizzo e-mail cui contattarLa in caso di eventuali richieste"]
[168,"X","Report1","Title","Stock Report Windows","Meldeformular Fenster","Modulo registrazione finestre / report stock finestre"]
[170,"X","Report1","Text","* Mandatory","* Eingabe erforderlich","* Campo obbligatorio"]
[172,"X","Report1","Text","Total:","Total:","Totale:"]
[174,null,"Report1","Text","* Stock count date","* Zählung am","* Conteggio al"]
[176,null,"Report1","Text","Sales for period","Absatz im Zeitraum","Vendite nel periodo"]
[178,null,"Report1","Text","Budget for period","Vorhersage für den Zeitraum","Previsione per il periodo"]
[180,null,"Report1","Text","to","bis","fino a "]
[182,"X","Report1","Column header","Material Number","Artikkelnummer","numero articolo"]
[184,"X","Report1","Column header","Material Group","Gruppe","gruppo (categoria)"]
[186,"X","Report1","Column header","Stock","Bestand","scorte (stock)"]
[188,null,"Report1","Column header","Sales","Absatz","vendita"]
[190,null,"Report1","Column header","Budget","Vorhersage","Previsione"]
[191,"X","Report1","Text","Other Windows total","Sonstige Fenster gesamt",">> Language translation is missing <<"]
[192,"X","Report1","Column header","Status","Status","stato"]
[194,null,"System","Mandatory checks","\"Please enter the customer number before you save\", \"Customer\"","\"Bitte geben Sie vor dem Speichern die Kundennummer an\", \"Customer\"","per favore, prima di salvare, inserire codice cliente, \"Cliente\" "]
[196,null,"System","Mandatory checks","\"Please enter the customer name before you save\", \"Customer\"","\"Bitte geben Sie vor dem Speichern den Firmennamen an\", \"Customer\"","per favore, prima di salvare, inserire la ragione sociale, \"Cliente\" "]
[198,null,"System","Mandatory checks","\"Please enter the stock report date before you save\", \"Report\"","\"Bitte geben Sie vor dem Speichern das Datum der Bestandsmeldung an\", \"Report1\"","per favore, prima di salvare, inserire la data del report delle scorte, \"Report1\" "]
[200,"X","System","Mandatory checks","Customer","Kunde","Cliente"]
[202,"X","System","Mandatory checks","Please enter Customer Number","Bitte geben Sie die Kundennummer an","per favore, prima di salvare, inserire codice cliente"]
[204,"X","System","Mandatory checks","Please enter Customer Name","Bitte geben Sie den Firmennamen an","per favore, prima di salvare, inserire la ragione sociale"]
[206,"X","System","Mandatory checks","Please enter Street Name","Tragen Sie hier bitte Ihre Strasse ein",">> Language translation is missing <<"]
[208,"X","System","Mandatory checks","Please enter Postal Code","Tragen Sie hier bitte Ihre PLZ ein",">> Language translation is missing <<"]
[210,"X","System","Mandatory checks","Please enter City Name","Tragen Sie hier bitte Ihren Ort ein",">> Language translation is missing <<"]
[212,"X","System","Mandatory checks","Please enter Contact Person","Tragen Sie hier bitte Ihren Vor- und Nachnamen ein",">> Language translation is missing <<"]
[214,"X","System","Mandatory checks","Report","Meldung",">> Language translation is missing <<"]
[216,"X","System","Mandatory checks","Please enter Report Period","Bitte geben Sie hier den Meldezeitraum ein",">> Language translation is missing <<"]
[218,"X","Report2","Title","Stock Report Rollershutters","Meldeformular Rollläden",">> Language translation is missing <<"]
[220,"X","Report1","Mandatory checks","Please select a valid entry","Bitte geben Sie einen gültigen Wert ein",">> Language translation is missing <<"]
[222,"X","Report1","Mandatory checks","The entered material number is not a window. Please select a valid entry from the list","Die eingegebene Artikelnummer ist kein Standard Fenster. Bitte wählen Sie eine Artikelnummer aus der Liste","Il codice dell'articolo inserito non è una finestra standard; prego scelga un articolo della lista proposta"]
[224,"X","Report1","Mandatory checks","Please enter a valid value","Bitte geben Sie einen gültigen Wert ein",">> Language translation is missing <<"]
[226,"X","Report1","Text","* Report:","* Meldung:",">> Language translation is missing <<"]
[228,"X","Report1","Text","* Year:","* Jahr:",">> Language translation is missing <<"]
[230,"X","Report2","Mandatory checks","Please select a material number from the list","Bitte wählen Sie eine Artikelnummer aus der Liste",">> Language translation is missing <<"]
[232,"X","Report2","Mandatory checks","Please enter a valid value","Bitte geben Sie einen gültigen Wert ein",">> Language translation is missing <<"]
[300,"X","Report","Item line status","Report period and year missing","Zähldatum, Meldung und/oder Jahr fehlt ",">> Language translation is missing <<"]
[302,"X","Report","Item line status","Missing quantity ","Bestandsmenge fehlt ","quantità di scorte mancanti "]
[304,"X","Report","Item line status","Customer name and/or number is missing ","Kundenname und/oder Nummer fehlt ","nominativo e/o numero cliente mancanti "]
[306,"X","Report","Item line status","Material number is missing ","Artikelnummer fehlt","numero articolo mancante "]
[308,"X","Report","Item line status","Double material number ","Artikelnummer doppelt ","numero articolo doppio "]
[312,"X","Report","Item line status","Wrong material group ","Falsche Produktgruppe ","categoria (gruppo) prodotto errata "]
[326,"X","Report1","Text","* Countdate:","* Zählung am:",">> Language translation is missing <<"]
[327,"X","System","Mandatory checks","Please enter Countdate","Bitte geben Sie hier den Tag der Zählung ein",">> Language translation is missing <<"]
[328,"X","Report1","Text","Cold room windows are not relevant for bonus","Kaltraumfenster sind nicht bonusrelevant",">> Language translation is missing <<"]

{"sheet":"Help","index":3,"n_rows":7,"n_cols":4,"rows_kept":7,"cut":false,"hidden":true,"merged":[]}
["Type","Title","Text (max 255 char)","Char"]
["Bestand Datum","Zählung am","Tragen Sie hier bitte das Datum ein, zu dem Sie Ihre Lagerbestände melden",{"$f":"LEN(C2)","v":73}]
["Absatz periode","Absatz im Zeitraum","Der Zeitraum ergibt sich aus dem Datum Ihrer Bestandsmeldung. Geben Sie bitte für den angegebenen Zeitraum den Absatz des Artikels an. (Diese Angabe ist freiwillig)",164]
["Vorhersage periode","Vorhersage für den Zeitraum","Der Zeitraum ergibt sich aus dem Datum Ihrer Bestandsmeldung. Geben Sie bitte für den angegebenen Zeitraum die  Absatzvorhersage für den Artikel an. (Diese Angabe ist freiwillig)",178]
["Premium Produkte","Meldeformular Optional","Mit diesem Formular können Sie zusätzlich Ihre Sonstige Fenster pro Artikelnummer melden. Diese Angaben sind nicht verpflichtend, um die Kriterien des Lagerbonus zu erfüllen",173]
[null,null,null,0]
[null,null,null,0]

{"sheet":"Lookup","index":4,"n_rows":242,"n_cols":4,"rows_kept":242,"cut":false,"hidden":true,"merged":[]}
["Text","Date",null,"Zähldatum"]
["1. Meldung (1. April)","1900-04-01",null,"2024-03-15"]
["2. Meldung (1. Juni)","1900-06-01",null,"2024-03-16"]
["3. Meldung (1. August)","1900-08-01",null,"2024-03-17"]
["4. Meldung (1. Oktober)","1900-10-01",null,"2024-03-18"]
[null,null,null,"2024-03-19"]
["Year",null,null,"2024-03-20"]
[2024,null,null,"2024-03-21"]
[null,null,null,"2024-03-22"]
[null,null,null,"2024-03-23"]
[null,null,null,"2024-03-24"]
[null,null,null,"2024-03-25"]
[null,null,null,"2024-03-26"]
[null,null,null,"2024-03-27"]
[null,null,null,"2024-03-28"]
[null,null,null,"2024-03-29"]
[null,null,null,"2024-03-30"]
[null,null,null,"2024-03-31"]
[null,null,null,"2024-04-01"]
[null,null,null,"2024-04-02"]
[null,null,null,"2024-04-03"]
[null,null,null,"2024-04-04"]
[null,null,null,"2024-04-05"]
[null,null,null,"2024-04-06"]
[null,null,null,"2024-04-07"]
[null,null,null,"2024-04-08"]
[null,null,null,"2024-04-09"]
[null,null,null,"2024-04-10"]
[null,null,null,"2024-04-11"]
[null,null,null,"2024-04-12"]
[null,null,null,"2024-04-13"]
[null,null,null,"2024-04-14"]
[null,null,null,"2024-04-15"]
[null,null,null,"2024-04-16"]
[null,null,null,"2024-04-17"]
[null,null,null,"2024-04-18"]
[null,null,null,"2024-04-19"]
[null,null,null,"2024-04-20"]
[null,null,null,"2024-04-21"]
[null,null,null,"2024-04-22"]
[null,null,null,"2024-04-23"]
[null,null,null,"2024-04-24"]
[null,null,null,"2024-04-25"]
[null,null,null,"2024-04-26"]
[null,null,null,"2024-04-27"]
[null,null,null,"2024-04-28"]
[null,null,null,"2024-04-29"]
[null,null,null,"2024-04-30"]
[null,null,null,"2024-05-01"]
[null,null,null,"2024-05-02"]
[null,null,null,"2024-05-03"]
[null,null,null,"2024-05-04"]
[null,null,null,"2024-05-05"]
[null,null,null,"2024-05-06"]
[null,null,null,"2024-05-07"]
[null,null,null,"2024-05-08"]
[null,null,null,"2024-05-09"]
[null,null,null,"2024-05-10"]
[null,null,null,"2024-05-11"]
[null,null,null,"2024-05-12"]
[null,null,null,"2024-05-13"]
[null,null,null,"2024-05-14"]
[null,null,null,"2024-05-15"]
[null,null,null,"2024-05-16"]
[null,null,null,"2024-05-17"]
[null,null,null,"2024-05-18"]
[null,null,null,"2024-05-19"]
[null,null,null,"2024-05-20"]
[null,null,null,"2024-05-21"]
[null,null,null,"2024-05-22"]
[null,null,null,"2024-05-23"]
[null,null,null,"2024-05-24"]
[null,null,null,"2024-05-25"]
[null,null,null,"2024-05-26"]
[null,null,null,"2024-05-27"]
[null,null,null,"2024-05-28"]
[null,null,null,"2024-05-29"]
[null,null,null,"2024-05-30"]
[null,null,null,"2024-05-31"]
[null,null,null,"2024-06-01"]
[null,null,null,"2024-06-02"]
[null,null,null,"2024-06-03"]
[null,null,null,"2024-06-04"]
[null,null,null,"2024-06-05"]
[null,null,null,"2024-06-06"]
[null,null,null,"2024-06-07"]
[null,null,null,"2024-06-08"]
[null,null,null,"2024-06-09"]
[null,null,null,"2024-06-10"]
[null,null,null,"2024-06-11"]
[null,null,null,"2024-06-12"]
[null,null,null,"2024-06-13"]
[null,null,null,"2024-06-14"]
[null,null,null,"2024-06-15"]
[null,null,null,"2024-06-16"]
[null,null,null,"2024-06-17"]
[null,null,null,"2024-06-18"]
[null,null,null,"2024-06-19"]
[null,null,null,"2024-06-20"]
[null,null,null,"2024-06-21"]
[null,null,null,"2024-06-22"]
[null,null,null,"2024-06-23"]
[null,null,null,"2024-06-24"]
[null,null,null,"2024-06-25"]
[null,null,null,"2024-06-26"]
[null,null,null,"2024-06-27"]
[null,null,null,"2024-06-28"]
[null,null,null,"2024-06-29"]
[null,null,null,"2024-06-30"]
[null,null,null,"2024-07-01"]
[null,null,null,"2024-07-02"]
[null,null,null,"2024-07-03"]
[null,null,null,"2024-07-04"]
[null,null,null,"2024-07-05"]
[null,null,null,"2024-07-06"]
[null,null,null,"2024-07-07"]
[null,null,null,"2024-07-08"]
[null,null,null,"2024-07-09"]
[null,null,null,"2024-07-10"]
[null,null,null,"2024-07-11"]
[null,null,null,"2024-07-12"]
[null,null,null,"2024-07-13"]
[null,null,null,"2024-07-14"]
[null,null,null,"2024-07-15"]
[null,null,null,"2024-07-16"]
[null,null,null,"2024-07-17"]
[null,null,null,"2024-07-18"]
[null,null,null,"2024-07-19"]
[null,null,null,"2024-07-20"]
[null,null,null,"2024-07-21"]
[null,null,null,"2024-07-22"]
[null,null,null,"2024-07-23"]
[null,null,null,"2024-07-24"]
[null,null,null,"2024-07-25"]
[null,null,null,"2024-07-26"]
[null,null,null,"2024-07-27"]
[null,null,null,"2024-07-28"]
[null,null,null,"2024-07-29"]
[null,null,null,"2024-07-30"]
[null,null,null,"2024-07-31"]
[null,null,null,"2024-08-01"]
[null,null,null,"2024-08-02"]
[null,null,null,"2024-08-03"]
[null,null,null,"2024-08-04"]
[null,null,null,"2024-08-05"]
[null,null,null,"2024-08-06"]
[null,null,null,"2024-08-07"]
[null,null,null,"2024-08-08"]
[null,null,null,"2024-08-09"]
[null,null,null,"2024-08-10"]
[null,null,null,"2024-08-11"]
[null,null,null,"2024-08-12"]
[null,null,null,"2024-08-13"]
[null,null,null,"2024-08-14"]
[null,null,null,"2024-08-15"]
[null,null,null,"2024-08-16"]
[null,null,null,"2024-08-17"]
[null,null,null,"2024-08-18"]
[null,null,null,"2024-08-19"]
[null,null,null,"2024-08-20"]
[null,null,null,"2024-08-21"]
[null,null,null,"2024-08-22"]
[null,null,null,"2024-08-23"]
[null,null,null,"2024-08-24"]
[null,null,null,"2024-08-25"]
[null,null,null,"2024-08-26"]
[null,null,null,"2024-08-27"]
[null,null,null,"2024-08-28"]
[null,null,null,"2024-08-29"]
[null,null,null,"2024-08-30"]
[null,null,null,"2024-08-31"]
[null,null,null,"2024-09-01"]
[null,null,null,"2024-09-02"]
[null,null,null,"2024-09-03"]
[null,null,null,"2024-09-04"]
[null,null,null,"2024-09-05"]
[null,null,null,"2024-09-06"]
[null,null,null,"2024-09-07"]
[null,null,null,"2024-09-08"]
[null,null,null,"2024-09-09"]
[null,null,null,"2024-09-10"]
[null,null,null,"2024-09-11"]
[null,null,null,"2024-09-12"]
[null,null,null,"2024-09-13"]
[null,null,null,"2024-09-14"]
[null,null,null,"2024-09-15"]
[null,null,null,"2024-09-16"]
[null,null,null,"2024-09-17"]
[null,null,null,"2024-09-18"]
[null,null,null,"2024-09-19"]
[null,null,null,"2024-09-20"]
[null,null,null,"2024-09-21"]
[null,null,null,"2024-09-22"]
[null,null,null,"2024-09-23"]
[null,null,null,"2024-09-24"]
[null,null,null,"2024-09-25"]
[null,null,null,"2024-09-26"]
[null,null,null,"2024-09-27"]
[null,null,null,"2024-09-28"]
[null,null,null,"2024-09-29"]
[null,null,null,"2024-09-30"]
[null,null,null,"2024-10-01"]
[null,null,null,"2024-10-02"]
[null,null,null,"2024-10-03"]
[null,null,null,"2024-10-04"]
[null,null,null,"2024-10-05"]
[null,null,null,"2024-10-06"]
[null,null,null,"2024-10-07"]
[null,null,null,"2024-10-08"]
[null,null,null,"2024-10-09"]
[null,null,null,"2024-10-10"]
[null,null,null,"2024-10-11"]
[null,null,null,"2024-10-12"]
[null,null,null,"2024-10-13"]
[null,null,null,"2024-10-14"]
[null,null,null,"2024-10-15"]
[null,null,null,"2024-10-16"]
[null,null,null,"2024-10-17"]
[null,null,null,"2024-10-18"]
[null,null,null,"2024-10-19"]
[null,null,null,"2024-10-20"]
[null,null,null,"2024-10-21"]
[null,null,null,"2024-10-22"]
[null,null,null,"2024-10-23"]
[null,null,null,"2024-10-24"]
[null,null,null,"2024-10-25"]
[null,null,null,"2024-10-26"]
[null,null,null,"2024-10-27"]
[null,null,null,"2024-10-28"]
[null,null,null,"2024-10-29"]
[null,null,null,"2024-10-30"]
[null,null,null,"2024-10-31"]
[null,null,null,"2024-11-01"]
[null,null,null,"2024-11-02"]
[null,null,null,"2024-11-03"]
[null,null,null,"2024-11-04"]
[null,null,null,"2024-11-05"]
[null,null,null,"2024-11-06"]
[null,null,null,"2024-11-07"]
[null,null,null,"2024-11-08"]
[null,null,null,"2024-11-09"]
[null,null,null,"2024-11-10"]

{"sheet":"Material1","index":5,"n_rows":2641,"n_cols":6,"rows_kept":2641,"cut":false,"hidden":true,"merged":[]}
["Material","MatType","UM","ValidFrom","ValidTo","Remark"]
[0,null,null,null,null,"Do not delete this line"]
["a",null,null,null,null,"Do not delete this line"]
["CFJ 060060 0010","Fenster","Stück","2005-12-01","2099-12-31"]
["CFJ 060060 1010","Fenster","Stück","2005-12-01","2099-12-31"]
["CFJ 060060 2020","Fenster","Stück","2005-12-01","2099-12-31"]
["CFJ 080080 0010","Fenster","Stück","2005-12-01","2099-12-31"]
["CFJ 080080 1010","Fenster","Stück","2005-12-01","2099-12-31"]
["CFJ 080080 2020","Fenster","Stück","2005-12-01","2099-12-31"]
["CFJ 090060 0010","Fenster","Stück","2005-12-01","2099-12-31"]
["CFJ 090060 1010","Fenster","Stück","2005-12-01","2099-12-31"]
["CFJ 090060 2020","Fenster","Stück","2005-12-01","2099-12-31"]
["CFJ 090090 0010","Fenster","Stück","2005-12-01","2099-12-31"]
["CFJ 090090 1010","Fenster","Stück","2005-12-01","2099-12-31"]
["CFJ 090090 2020","Fenster","Stück","2005-12-01","2099-12-31"]
["CFJ 100100 0010","Fenster","Stück","2005-12-01","2099-12-31"]
["CFJ 100100 1010","Fenster","Stück","2005-12-01","2099-12-31"]
["CFJ 100100 2020","Fenster","Stück","2005-12-01","2099-12-31"]
["CFJ 120090 0010","Fenster","Stück","2005-12-01","2099-12-31"]
["CFJ 120090 1010","Fenster","Stück","2005-12-01","2099-12-31"]
["CFJ 120090 2020","Fenster","Stück","2005-12-01","2099-12-31"]
["CFJ 120120 0010","Fenster","Stück","2005-12-01","2099-12-31"]
["CFJ 120120 1010","Fenster","Stück","2005-12-01","2099-12-31"]
["CFJ 120120 2020","Fenster","Stück","2005-12-01","2099-12-31"]
["CFJ 150100 0010","Fenster","Stück","2005-12-01","2099-12-31"]
["CFJ 150100 1010","Fenster","Stück","2005-12-01","2099-12-31"]
["CFJ 150100 2020","Fenster","Stück","2005-12-01","2099-12-31"]
["CFJ 150150 0010","Fenster","Stück","2005-12-01","2099-12-31"]
["CFJ 150150 1010","Fenster","Stück","2005-12-01","2099-12-31"]
["CFJ 150150 2020","Fenster","Stück","2005-12-01","2099-12-31"]
["CFJ 200100 0010","Fenster","Stück","2005-12-01","2099-12-31"]
["CFP 060060 0073QV","Fenster","Stück","2005-12-01","2099-12-31"]
["CFP 060090 0073QV","Fenster","Stück","2005-12-01","2099-12-31"]
["CFP 080080 0073QV","Fenster","Stück","2005-12-01","2099-12-31"]
["CFP 090090 0073QV","Fenster","Stück","2005-12-01","2099-12-31"]
["CFP 090120 0073QV","Fenster","Stück","2005-12-01","2099-12-31"]
["CFP 100100 0073QV","Fenster","Stück","2005-12-01","2099-12-31"]
["CFP 100150 0073QV","Fenster","Stück","2005-12-01","2099-12-31"]
["CFP 120120 0073QV","Fenster","Stück","2005-12-01","2099-12-31"]
["CFP 150150 0063QV","Fenster","Stück","2005-12-01","2099-12-31"]
["CFU 060060 0020Q","Fenster","Stück","2005-12-01","2099-12-31"]
["CFU 060060 0025Q","Fenster","Stück","2005-12-01","2099-12-31"]
["CFU 080080 0020Q","Fenster","Stück","2005-12-01","2099-12-31"]
["CFU 080080 0025Q","Fenster","Stück","2005-12-01","2099-12-31"]
["CFU 090060 0020Q","Fenster","Stück","2005-12-01","2099-12-31"]
["CFU 090060 0025Q","Fenster","Stück","2005-12-01","2099-12-31"]
["CFU 090090 0020Q","Fenster","Stück","2005-12-01","2099-12-31"]
["CFU 090090 0025Q","Fenster","Stück","2005-12-01","2099-12-31"]
["CFU 100100 0020Q","Fenster","Stück","2005-12-01","2099-12-31"]
["CFU 100100 0025Q","Fenster","Stück","2005-12-01","2099-12-31"]
["CFU 120090 0020Q","Fenster","Stück","2005-12-01","2099-12-31"]
["CFU 120090 0025Q","Fenster","Stück","2005-12-01","2099-12-31"]
["CFU 120120 0020Q","Fenster","Stück","2005-12-01","2099-12-31"]
["CFU 120120 0025Q","Fenster","Stück","2005-12-01","2099-12-31"]
["CFU 150080 0020Q","Fenster","Stück","2005-12-01","2099-12-31"]
["CFU 150080 0025Q","Fenster","Stück","2005-12-01","2099-12-31"]
["CFU 150100 0020Q","Fenster","Stück","2005-12-01","2099-12-31"]
["CFU 150100 0025Q","Fenster","Stück","2005-12-01","2099-12-31"]
["CFU 150120 0020Q","Fenster","Stück","2005-12-01","2099-12-31"]
["CFU 150120 0025Q","Fenster","Stück","2005-12-01","2099-12-31"]
["CFU 150150 0020Q","Fenster","Stück","2005-12-01","2099-12-31"]
["CFU 150150 0025Q","Fenster","Stück","2005-12-01","2099-12-31"]
["CFU 200060 0020Q","Fenster","Stück","2005-12-01","2099-12-31"]
["CFU 200060 0025Q","Fenster","Stück","2005-12-01","2099-12-31"]
["CFU 200100 0020Q","Fenster","Stück","2005-12-01","2099-12-31"]
["CFU 200100 0025Q","Fenster","Stück","2005-12-01","2099-12-31"]
["CSJ 120120 1210","Fenster","Stück","2005-12-01","2099-12-31"]
["CSJ 120120 1211","Fenster","Stück","2005-12-01","2099-12-31"]
["CSJ 150100 1211","Fenster","Stück","2005-12-01","2099-12-31"]
["CSP 100100 1073Q","Fenster","Stück","2005-12-01","2099-12-31"]
["CSP 120120 1073Q","Fenster","Stück","2005-12-01","2099-12-31"]
["CVJ 060060 0210","Fenster","Stück","2005-12-01","2099-12-31"]
["CVJ 060060 1210","Fenster","Stück","2005-12-01","2099-12-31"]
["CVJ 060060 2220","Fenster","Stück","2005-12-01","2099-12-31"]
["CVJ 080080 0210","Fenster","Stück","2005-12-01","2099-12-31"]
["CVJ 080080 1210","Fenster","Stück","2005-12-01","2099-12-31"]
["CVJ 080080 2220","Fenster","Stück","2005-12-01","2099-12-31"]
["CVJ 090060 0210","Fenster","Stück","2005-12-01","2099-12-31"]
["CVJ 090060 1210","Fenster","Stück","2005-12-01","2099-12-31"]
["CVJ 090060 2220","Fenster","Stück","2005-12-01","2099-12-31"]
["CVJ 090090 0210","Fenster","Stück","2005-12-01","2099-12-31"]
["CVJ 090090 1210","Fenster","Stück","2005-12-01","2099-12-31"]
["CVJ 090090 2220","Fenster","Stück","2005-12-01","2099-12-31"]
["CVJ 100100 0210","Fenster","Stück","2005-12-01","2099-12-31"]
["CVJ 100100 1210","Fenster","Stück","2005-12-01","2099-12-31"]
["CVJ 100100 2220","Fenster","Stück","2005-12-01","2099-12-31"]
["CVJ 120090 0210","Fenster","Stück","2005-12-01","2099-12-31"]
["CVJ 120090 1210","Fenster","Stück","2005-12-01","2099-12-31"]
["CVJ 120090 2220","Fenster","Stück","2005-12-01","2099-12-31"]
["CVJ 120120 0210","Fenster","Stück","2005-12-01","2099-12-31"]
["CVJ 120120 1210","Fenster","Stück","2005-12-01","2099-12-31"]
["CVJ 120120 2220","Fenster","Stück","2005-12-01","2099-12-31"]
["CVJ 150100 0210","Fenster","Stück","2005-12-01","2099-12-31"]
["CVJ 150100 1210","Fenster","Stück","2005-12-01","2099-12-31"]
["CVJ 150100 2220","Fenster","Stück","2005-12-01","2099-12-31"]
["CVJ 150150 0210","Fenster","Stück","2005-12-01","2099-12-31"]
["CVJ 150150 1210","Fenster","Stück","2005-12-01","2099-12-31"]
["CVJ 150150 2220","Fenster","Stück","2005-12-01","2099-12-31"]
["CVJ 200100 0210","Fenster","Stück","2005-12-01","2099-12-31"]
["CVP 060060 0673QV","Fenster","Stück","2005-12-01","2099-12-31"]
["CVP 060090 0673QV","Fenster","Stück","2005-12-01","2099-12-31"]
["CVP 080080 0673QV","Fenster","Stück","2005-12-01","2099-12-31"]
["CVP 090090 0673QV","Fenster","Stück","2005-12-01","2099-12-31"]
["CVP 090120 0673QV","Fenster","Stück","2005-12-01","2099-12-31"]
["CVP 100100 0673QV","Fenster","Stück","2005-12-01","2099-12-31"]
["CVP 100150 0673QV","Fenster","Stück","2005-12-01","2099-12-31"]
["CVP 120120 0673QV","Fenster","Stück","2005-12-01","2099-12-31"]
["CVP 150150 0663QV","Fenster","Stück","2005-12-01","2099-12-31"]
["CVU 060060 0220Q","Fenster","Stück","2005-12-01","2099-12-31"]
["CVU 060060 0225Q","Fenster","Stück","2005-12-01","2099-12-31"]
["CVU 060060 0320Q","Fenster","Stück","2005-12-01","2099-12-31"]
["CVU 060060 0325Q","Fenster","Stück","2005-12-01","2099-12-31"]
["CVU 080080 0220Q","Fenster","Stück","2005-12-01","2099-12-31"]
["CVU 080080 0225Q","Fenster","Stück","2005-12-01","2099-12-31"]
["CVU 080080 0320Q","Fenster","Stück","2005-12-01","2099-12-31"]
["CVU 080080 0325Q","Fenster","Stück","2005-12-01","2099-12-31"]
["CVU 090060 0220Q","Fenster","Stück","2005-12-01","2099-12-31"]
["CVU 090060 0225Q","Fenster","Stück","2005-12-01","2099-12-31"]
["CVU 090060 0320Q","Fenster","Stück","2005-12-01","2099-12-31"]
["CVU 090060 0325Q","Fenster","Stück","2005-12-01","2099-12-31"]
["CVU 090090 0220Q","Fenster","Stück","2005-12-01","2099-12-31"]
["CVU 090090 0225Q","Fenster","Stück","2005-12-01","2099-12-31"]
["CVU 090090 0320Q","Fenster","Stück","2005-12-01","2099-12-31"]
["CVU 090090 0325Q","Fenster","Stück","2005-12-01","2099-12-31"]
["CVU 100100 0220Q","Fenster","Stück","2005-12-01","2099-12-31"]
["CVU 100100 0225Q","Fenster","Stück","2005-12-01","2099-12-31"]
["CVU 100100 0320Q","Fenster","Stück","2005-12-01","2099-12-31"]
["CVU 100100 0325Q","Fenster","Stück","2005-12-01","2099-12-31"]
["CVU 120090 0220Q","Fenster","Stück","2005-12-01","2099-12-31"]
["CVU 120090 0225Q","Fenster","Stück","2005-12-01","2099-12-31"]
["CVU 120090 0320Q","Fenster","Stück","2005-12-01","2099-12-31"]
["CVU 120090 0325Q","Fenster","Stück","2005-12-01","2099-12-31"]
["CVU 120120 0220Q","Fenster","Stück","2005-12-01","2099-12-31"]
["CVU 120120 0225Q","Fenster","Stück","2005-12-01","2099-12-31"]
["CVU 120120 0320Q","Fenster","Stück","2005-12-01","2099-12-31"]
["CVU 120120 0325Q","Fenster","Stück","2005-12-01","2099-12-31"]
["CVU 150080 0220Q","Fenster","Stück","2005-12-01","2099-12-31"]
["CVU 150080 0225Q","Fenster","Stück","2005-12-01","2099-12-31"]
["CVU 150080 0320Q","Fenster","Stück","2005-12-01","2099-12-31"]
["CVU 150080 0325Q","Fenster","Stück","2005-12-01","2099-12-31"]
["CVU 150100 0220Q","Fenster","Stück","2005-12-01","2099-12-31"]
["CVU 150100 0225Q","Fenster","Stück","2005-12-01","2099-12-31"]
["CVU 150100 0320Q","Fenster","Stück","2005-12-01","2099-12-31"]
["CVU 150100 0325Q","Fenster","Stück","2005-12-01","2099-12-31"]
["CVU 150120 0220Q","Fenster","Stück","2005-12-01","2099-12-31"]
["CVU 150120 0225Q","Fenster","Stück","2005-12-01","2099-12-31"]
["CVU 150120 0320Q","Fenster","Stück","2005-12-01","2099-12-31"]
["CVU 150120 0325Q","Fenster","Stück","2005-12-01","2099-12-31"]
["CVU 150150 0220Q","Fenster","Stück","2005-12-01","2099-12-31"]
["CVU 150150 0225Q","Fenster","Stück","2005-12-01","2099-12-31"]
["CVU 150150 0320Q","Fenster","Stück","2005-12-01","2099-12-31"]
["CVU 150150 0325Q","Fenster","Stück","2005-12-01","2099-12-31"]
["CVU 200060 0220Q","Fenster","Stück","2005-12-01","2099-12-31"]
["CVU 200060 0225Q","Fenster","Stück","2005-12-01","2099-12-31"]
["CVU 200060 0320Q","Fenster","Stück","2005-12-01","2099-12-31"]
["CVU 200060 0325Q","Fenster","Stück","2005-12-01","2099-12-31"]
["CVU 200100 0220Q","Fenster","Stück","2005-12-01","2099-12-31"]
["CVU 200100 0225Q","Fenster","Stück","2005-12-01","2099-12-31"]
["CVU 200100 0320Q","Fenster","Stück","2005-12-01","2099-12-31"]
["CVU 200100 0325Q","Fenster","Stück","2005-12-01","2099-12-31"]
["CXP 090120 0473Q","Fenster","Stück","2005-12-01","2099-12-31"]
["CXP 100100 0473Q","Fenster","Stück","2005-12-01","2099-12-31"]
["CXP 120120 0473Q","Fenster","Stück","2005-12-01","2099-12-31"]
["GDL MK19 2066P1","Fenster","Stück","2005-12-01","2099-12-31"]
["GDL MK19 2066P2","Fenster","Stück","2005-12-01","2099-12-31"]
["GDL MK19 2166P1","Fenster","Stück","2005-12-01","2099-12-31"]
["GDL MK19 2166P2","Fenster","Stück","2005-12-01","2099-12-31"]
["GDL MK19 2366P1","Fenster","Stück","2005-12-01","2099-12-31"]
["GDL MK19 2366P2","Fenster","Stück","2005-12-01","2099-12-31"]
["GDL MK19 3066P1","Fenster","Stück","2005-12-01","2099-12-31"]
["GDL MK19 3066P2","Fenster","Stück","2005-12-01","2099-12-31"]
["GDL MK19 3166P1","Fenster","Stück","2005-12-01","2099-12-31"]
["GDL MK19 3166P2","Fenster","Stück","2005-12-01","2099-12-31"]
["GDL MK19 3366P1","Fenster","Stück","2005-12-01","2099-12-31"]
["GDL MK19 3366P2","Fenster","Stück","2005-12-01","2099-12-31"]
["GDL PK19 2066P1","Fenster","Stück","2005-12-01","2099-12-31"]
["GDL PK19 2066P2","Fenster","Stück","2005-12-01","2099-12-31"]
["GDL PK19 2166P1","Fenster","Stück","2005-12-01","2099-12-31"]
["GDL PK19 2166P2","Fenster","Stück","2005-12-01","2099-12-31"]
["GDL PK19 2366P1","Fenster","Stück","2005-12-01","2099-12-31"]
["GDL PK19 2366P2","Fenster","Stück","2005-12-01","2099-12-31"]
["GDL PK19 3066P1","Fenster","Stück","2005-12-01","2099-12-31"]
["GDL PK19 3066P2","Fenster","Stück","2005-12-01","2099-12-31"]
["GDL PK19 3166P1","Fenster","Stück","2005-12-01","2099-12-31"]
["GDL PK19 3166P2","Fenster","Stück","2005-12-01","2099-12-31"]
["GDL PK19 3366P1","Fenster","Stück","2005-12-01","2099-12-31"]
["GDL PK19 3366P2","Fenster","Stück","2005-12-01","2099-12-31"]
["GDL SK19 2066P1","Fenster","Stück","2005-12-01","2099-12-31"]
["GDL SK19 2066P2","Fenster","Stück","2005-12-01","2099-12-31"]
["GDL SK19 2166LP1","Fenster","Stück","2005-12-01","2099-12-31"]
["GDL SK19 2166LP2","Fenster","Stück","2005-12-01","2099-12-31"]
["GDL SK19 2366LP1","Fenster","Stück","2005-12-01","2099-12-31"]
["GDL SK19 2366LP2","Fenster","Stück","2005-12-01","2099-12-31"]
["GDL SK19 3066P1","Fenster","Stück","2005-12-01","2099-12-31"]
["GDL SK19 3066P2","Fenster","Stück","2005-12-01","2099-12-31"]
["GDL SK19 3166LP1","Fenster","Stück","2005-12-01","2099-12-31"]
["GDL SK19 3166LP2","Fenster","Stück","2005-12-01","2099-12-31"]
["GDL SK19 3366LP1","Fenster","Stück","2005-12-01","2099-12-31"]
["GDL SK19 3366LP2","Fenster","Stück","2005-12-01","2099-12-31"]
["GEL M08 2065","Fenster","Stück","2005-12-01","2099-12-31"]
["GEL M08 3065","Fenster","Stück","2005-12-01","2099-12-31"]
["GGL CK02 2062","Fenster","Stück","2005-12-01","2099-12-31"]
["GGL CK02 206221","Fenster","Stück","2005-12-01","2099-12-31"]
["GGL CK02 2066","Fenster","Stück","2005-12-01","2099-12-31"]
["GGL CK02 206621","Fenster","Stück","2005-12-01","2099-12-31"]
["GGL CK02 206630","Fenster","Stück","2005-12-01","2099-12-31"]
["GGL CK02 206721","Fenster","Stück","2005-12-01","2099-12-31"]
["GGL CK02 206730","Fenster","Stück","2005-12-01","2099-12-31"]
["GGL CK02 2068","Fenster","Stück","2005-12-01","2099-12-31"]
["GGL CK02 206821","Fenster","Stück","2005-12-01","2099-12-31"]
["GGL CK02 206830","Fenster","Stück","2005-12-01","2099-12-31"]
["GGL CK02 2069","Fenster","Stück","2005-12-01","2099-12-31"]
["GGL CK02 206921","Fenster","Stück","2005-12-01","2099-12-31"]
["GGL CK02 206930","Fenster","Stück","2005-12-01","2099-12-31"]
["GGL CK02 2070","Fenster","Stück","2005-12-01","2099-12-31"]
["GGL CK02 207021","Fenster","Stück","2005-12-01","2099-12-31"]
["GGL CK02 207030","Fenster","Stück","2005-12-01","2099-12-31"]
["GGL CK02 2070Q","Fenster","Stück","2005-12-01","2099-12-31"]
["GGL CK02 2084","Fenster","Stück","2005-12-01","2099-12-31"]
["GGL CK02 208421","Fenster","Stück","2005-12-01","2099-12-31"]
["GGL CK02 208430","Fenster","Stück","2005-12-01","2099-12-31"]
["GGL CK02 2184","Fenster","Stück","2005-12-01","2099-12-31"]
["GGL CK02 218421","Fenster","Stück","2005-12-01","2099-12-31"]
["GGL CK02 218430","Fenster","Stück","2005-12-01","2099-12-31"]
["GGL CK02 2384","Fenster","Stück","2005-12-01","2099-12-31"]
["GGL CK02 238430","Fenster","Stück","2005-12-01","2099-12-31"]
["GGL CK02 3062","Fenster","Stück","2005-12-01","2099-12-31"]
["GGL CK02 306221","Fenster","Stück","2005-12-01","2099-12-31"]
["GGL CK02 3066","Fenster","Stück","2005-12-01","2099-12-31"]
["GGL CK02 306621","Fenster","Stück","2005-12-01","2099-12-31"]
["GGL CK02 306630","Fenster","Stück","2005-12-01","2099-12-31"]
["GGL CK02 3067","Fenster","Stück","2005-12-01","2099-12-31"]
["GGL CK02 306721","Fenster","Stück","2005-12-01","2099-12-31"]
["GGL CK02 306730","Fenster","Stück","2005-12-01","2099-12-31"]
["GGL CK02 3068","Fenster","Stück","2005-12-01","2099-12-31"]
["GGL CK02 306821","Fenster","Stück","2005-12-01","2099-12-31"]
["GGL CK02 306830","Fenster","Stück","2005-12-01","2099-12-31"]
["GGL CK02 3069","Fenster","Stück","2005-12-01","2099-12-31"]
["GGL CK02 306921","Fenster","Stück","2005-12-01","2099-12-31"]
["GGL CK02 306930","Fenster","Stück","2005-12-01","2099-12-31"]
["GGL CK02 3070","Fenster","Stück","2005-12-01","2099-12-31"]
["GGL CK02 307021","Fenster","Stück","2005-12-01","2099-12-31"]
["GGL CK02 307030","Fenster","Stück","2005-12-01","2099-12-31"]
["GGL CK02 3070Q","Fenster","Stück","2005-12-01","2099-12-31"]
["GGL CK02 3084","Fenster","Stück","2005-12-01","2099-12-31"]
["GGL CK02 308421","Fenster","Stück","2005-12-01","2099-12-31"]
["GGL CK02 308430","Fenster","Stück","2005-12-01","2099-12-31"]
["GGL CK02 3184","Fenster","Stück","2005-12-01","2099-12-31"]
["GGL CK02 318421","Fenster","Stück","2005-12-01","2099-12-31"]
["GGL CK02 318430","Fenster","Stück","2005-12-01","2099-12-31"]
["GGL CK02 3384","Fenster","Stück","2005-12-01","2099-12-31"]
["GGL CK02 338430","Fenster","Stück","2005-12-01","2099-12-31"]
["GGL CK04 2062","Fenster","Stück","2005-12-01","2099-12-31"]
["GGL CK04 206221","Fenster","Stück","2005-12-01","2099-12-31"]
["GGL CK04 2066","Fenster","Stück","2005-12-01","2099-12-31"]
["GGL CK04 206621","Fenster","Stück","2005-12-01","2099-12-31"]
["GGL CK04 206630","Fenster","Stück","2005-12-01","2099-12-31"]
["GGL CK04 2067","Fenster","Stück","2005-12-01","2099-12-31"]
["GGL CK04 206721","Fenster","Stück","2005-12-01","2099-12-31"]
["GGL CK04 206730","Fenster","Stück","2005-12-01","2099-12-31"]
["GGL CK04 2068","Fenster","Stück","2005-12-01","2099-12-31"]
["GGL CK04 206821","Fenster","Stück","2005-12-01","2099-12-31"]
["GGL CK04 206830","Fenster","Stück","2005-12-01","2099-12-31"]
["GGL CK04 2069","Fenster","Stück","2005-12-01","2099-12-31"]
["GGL CK04 206921","Fenster","Stück","2005-12-01","2099-12-31"]
["GGL CK04 206930","Fenster","Stück","2005-12-01","2099-12-31"]
["GGL CK04 2070","Fenster","Stück","2005-12-01","2099-12-31"]
["GGL CK04 207021","Fenster","Stück","2005-12-01","2099-12-31"]
["GGL CK04 207030","Fenster","Stück","2005-12-01","2099-12-31"]
["GGL CK04 2070Q","Fenster","Stück","2005-12-01","2099-12-31"]
["GGL CK04 2084","Fenster","Stück","2005-12-01","2099-12-31"]
["GGL CK04 208421","Fenster","Stück","2005-12-01","2099-12-31"]
["GGL CK04 208430","Fenster","Stück","2005-12-01","2099-12-31"]
["GGL CK04 2184","Fenster","Stück","2005-12-01","2099-12-31"]
["GGL CK04 218421","Fenster","Stück","2005-12-01","2099-12-31"]
["GGL CK04 218430","Fenster","Stück","2005-12-01","2099-12-31"]
["GGL CK04 2384","Fenster","Stück","2005-12-01","2099-12-31"]
["GGL CK04 238430","Fenster","Stück","2005-12-01","2099-12-31"]
["GGL CK04 3062","Fenster","Stück","2005-12-01","2099-12-31"]
["GGL CK04 306221","Fenster","Stück","2005-12-01","2099-12-31"]
["GGL CK04 3066","Fenster","Stück","2005-12-01","2099-12-31"]
["GGL CK04 306621","Fenster","Stück","2005-12-01","2099-12-31"]
["GGL CK04 306630","Fenster","Stück","2005-12-01","2099-12-31"]
["GGL CK04 3067","Fenster","Stück","2005-12-01","2099-12-31"]
["GGL CK04 306721","Fenster","Stück","2005-12-01","2099-12-31"]
["GGL CK04 306730","Fenster","Stück","2005-12-01","2099-12-31"]
["GGL CK04 3068","Fenster","Stück","2005-12-01","2099-12-31"]
["GGL CK04 306821","Fenster","Stück","2005-12-01","2099-12-31"]
["GGL CK04 306830","Fenster","Stück","2005-12-01","2099-12-31"]
["GGL CK04 3069","Fenster","Stück","2005-12-01","2099-12-31"]
["GGL CK04 306921","Fenster","Stück","2005-12-01","2099-12-31"]
["GGL CK04 306930","Fenster","Stück","2005-12-01","2099-12-31"]
["GGL CK04 3070","Fenster","Stück","2005-12-01","2099-12-31"]
["GGL CK04 307021","Fenster","Stück","2005-12-01","2099-12-31"]
["GGL CK04 307030","Fenster","Stück","2005-12-01","2099-12-31"]
["GGL CK04 3070Q","Fenster","Stück","2005-12-01","2099-12-31"]
["GGL CK04 3084","Fenster","Stück","2005-12-01","2099-12-31"]
["GGL CK04 308421","Fenster","Stück","2005-12-01","2099-12-31"]
["GGL CK04 308430","Fenster","Stück","2005-12-01","2099-12-31"]
["GGL CK04 3184","Fenster","Stück","2005-12-01","2099-12-31"]
["GGL CK04 318421","Fenster","Stück","2005-12-01","2099-12-31"]
["GGL CK04 318430","Fenster","Stück","2005-12-01","2099-12-31"]
["GGL CK04 3384","Fenster","Stück","2005-12-01","2099-12-31"]
["GGL CK04 338430","Fenster","Stück","2005-12-01","2099-12-31"]
["GGL CK06 2062","Fenster","Stück","2005-12-01","2099-12-31"]
["GGL CK06 206221","Fenster","Stück","2005-12-01","2099-12-31"]
["GGL CK06 2066","Fenster","Stück","2005-12-01","2099-12-31"]
["GGL CK06 206621","Fenster","Stück","2005-12-01","2099-12-31"]
["GGL CK06 206630","Fenster","Stück","2005-12-01","2099-12-31"]
["GGL CK06 2067","Fenster","Stück","2005-12-01","2099-12-31"]
["GGL CK06 206721","Fenster","Stück","2005-12-01","2099-12-31"]
["GGL CK06 206730","Fenster","Stück","2005-12-01","2099-12-31"]
["GGL CK06 2068","Fenster","Stück","2005-12-01","2099-12-31"]
["GGL CK06 206821","Fenster","Stück","2005-12-01","2099-12-31"]
["GGL CK06 206830","Fenster","Stück","2005-12-01","2099-12-31"]
["GGL CK06 2069","Fenster","Stück","2005-12-01","2099-12-31"]
["GGL CK06 206921","Fenster","Stück","2005-12-01","2099-12-31"]
["GGL CK06 206930","Fenster","Stück","2005-12-01","2099-12-31"]
["GGL CK06 2070","Fenster","Stück","2005-12-01","2099-12-31"]
["GGL CK06 207021","Fenster","Stück","2005-12-01","2099-12-31"]
["GGL CK06 207030","Fenster","Stück","2005-12-01","2099-12-31"]
["GGL CK06 2084","Fenster","Stück","2005-12-01","2099-12-31"]
["GGL CK06 208421","Fenster","Stück","2005-12-01","2099-12-31"]
["GGL CK06 208430","Fenster","Stück","2005-12-01","2099-12-31"]
["GGL CK06 2184","Fenster","Stück","2005-12-01","2099-12-31"]
["GGL CK06 218421","Fenster","Stück","2005-12-01","2099-12-31"]
["GGL CK06 218430","Fenster","Stück","2005-12-01","2099-12-31"]
["GGL CK06 2384","Fenster","Stück","2005-12-01","2099-12-31"]
["GGL CK06 238430","Fenster","Stück","2005-12-01","2099-12-31"]
["GGL CK06 3062","Fenster","Stück","2005-12-01","2099-12-31"]
["GGL CK06 306221","Fenster","Stück","2005-12-01","2099-12-31"]
["GGL CK06 3066","Fenster","Stück","2005-12-01","2099-12-31"]
["GGL CK06 306621","Fenster","Stück","2005-12-01","2099-12-31"]
["GGL CK06 306630","Fenster","Stück","2005-12-01","2099-12-31"]
["GGL CK06 3067","Fenster","Stück","2005-12-01","2099-12-31"]
["GGL CK06 306721","Fenster","Stück","2005-12-01","2099-12-31"]
["GGL CK06 306730","Fenster","Stück","2005-12-01","2099-12-31"]
["GGL CK06 3068","Fenster","Stück","2005-12-01","2099-12-31"]
["GGL CK06 306821","Fenster","Stück","2005-12-01","2099-12-31"]
["GGL CK06 306830","Fenster","Stück","2005-12-01","2099-12-31"]
["GGL CK06 3069","Fenster","Stück","2005-12-01","2099-12-31"]
["GGL CK06 306921","Fenster","Stück","2005-12-01","2099-12-31"]
["GGL CK06 306930","Fenster","Stück","2005-12-01","2099-12-31"]
["GGL CK06 3070","Fenster","Stück","2005-12-01","2099-12-31"]
["GGL CK06 307021","Fenster","Stück","2005-12-01","2099-12-31"]
["GGL CK06 307030","Fenster","Stück","2005-12-01","2099-12-31"]
["GGL CK06 3084","Fenster","Stück","2005-12-01","2099-12-31"]
["GGL CK06 308421","Fenster","Stück","2005-12-01","2099-12-31"]
["GGL CK06 308430","Fenster","Stück","2005-12-01","2099-12-31"]
["GGL CK06 3184","Fenster","Stück","2005-12-01","2099-12-31"]
["GGL CK06 318421","Fenster","Stück","2005-12-01","2099-12-31"]
["GGL CK06 318430","Fenster","Stück","2005-12-01","2099-12-31"]
["GGL CK06 3384","Fenster","Stück","2005-12-01","2099-12-31"]
["GGL FK04 2062","Fenster","Stück","2005-12-01","2099-12-31"]
["GGL FK04 206221","Fenster","Stück","2005-12-01","2099-12-31"]
["GGL FK04 2062D","Fenster","Stück","2005-12-01","2099-12-31"]
["GGL FK04 2062D21","Fenster","Stück","2005-12-01","2099-12-31"]
["GGL FK04 2066","Fenster","Stück","2005-12-01","2099-12-31"]
["GGL FK04 206621","Fenster","Stück","2005-12-01","2099-12-31"]
["GGL FK04 2067","Fenster","Stück","2005-12-01","2099-12-31"]
["GGL FK04 206721","Fenster","Stück","2005-12-01","2099-12-31"]
["GGL FK04 2068","Fenster","Stück","2005-12-01","2099-12-31"]
["GGL FK04 206821","Fenster","Stück","2005-12-01","2099-12-31"]
["GGL FK04 2069","Fenster","Stück","2005-12-01","2099-12-31"]
["GGL FK04 206921","Fenster","Stück","2005-12-01","2099-12-31"]
["GGL FK04 2070","Fenster","Stück","2005-12-01","2099-12-31"]
["GGL FK04 207021","Fenster","Stück","2005-12-01","2099-12-31"]
["GGL FK04 207030","Fenster","Stück","2005-12-01","2099-12-31"]
["GGL FK04 2084","Fenster","Stück","2005-12-01","2099-12-31"]
["GGL FK04 208421","Fenster","Stück","2005-12-01","2099-12-31"]
["GGL FK04 208430","Fenster","Stück","2005-12-01","2099-12-31"]
["GGL FK04 2184","Fenster","Stück","2005-12-01","2099-12-31"]
["GGL FK04 218421","Fenster","Stück","2005-12-01","2099-12-31"]
["GGL FK04 2384","Fenster","Stück","2005-12-01","2099-12-31"]
["GGL FK04 3062","Fenster","Stück","2005-12-01","2099-12-31"]
["GGL FK04 306221","Fenster","Stück","2005-12-01","2099-12-31"]
["GGL FK04 3062D","Fenster","Stück","2005-12-01","2099-12-31"]
["GGL FK04 3062D21","Fenster","Stück","2005-12-01","2099-12-31"]
["GGL FK04 3066","Fenster","Stück","2005-12-01","2099-12-31"]
["GGL FK04 306621","Fenster","Stück","2005-12-01","2099-12-31"]
["GGL FK04 3067","Fenster","Stück","2005-12-01","2099-12-31"]
["GGL FK04 306721","Fenster","Stück","2005-12-01","2099-12-31"]
["GGL FK04 3068","Fenster","Stück","2005-12-01","2099-12-31"]
["GGL FK04 306821","Fenster","Stück","2005-12-01","2099-12-31"]
["GGL FK04 3069","Fenster","Stück","2005-12-01","2099-12-31"]
["GGL FK04 306921","Fenster","Stück","2005-12-01","2099-12-31"]
["GGL FK04 3070","Fenster","Stück","2005-12-01","2099-12-31"]
["GGL FK04 307021","Fenster","Stück","2005-12-01","2099-12-31"]
["GGL FK04 307030","Fenster","Stück","2005-12-01","2099-12-31"]
["GGL FK04 3084","Fenster","Stück","2005-12-01","2099-12-31"]
["GGL FK04 308421","Fenster","Stück","2005-12-01","2099-12-31"]
["GGL FK04 308430","Fenster","Stück","2005-12-01","2099-12-31"]
["GGL FK04 3184","Fenster","Stück","2005-12-01","2099-12-31"]
["GGL FK04 3384","Fenster","Stück","2005-12-01","2099-12-31"]
["GGL FK06 2062","Fenster","Stück","2005-12-01","2099-12-31"]
["GGL FK06 206221","Fenster","Stück","2005-12-01","2099-12-31"]
["GGL FK06 2062D","Fenster","Stück","2005-12-01","2099-12-31"]
["GGL FK06 2062D21","Fenster","Stück","2005-12-01","2099-12-31"]
["GGL FK06 2066","Fenster","Stück","2005-12-01","2099-12-31"]
["GGL FK06 206621","Fenster","Stück","2005-12-01","2099-12-31"]
["GGL FK06 206630","Fenster","Stück","2005-12-01","2099-12-31"]
["GGL FK06 2067","Fenster","Stück","2005-12-01","2099-12-31"]
["GGL FK06 206721","Fenster","Stück","2005-12-01","2099-12-31"]
["GGL FK06 206730","Fenster","Stück","2005-12-01","2099-12-31"]
["GGL FK06 2068","Fenster","Stück","2005-12-01","2099-12-31"]
["GGL FK06 206821","Fenster","Stück","2005-12-01","2099-12-31"]
["GGL FK06 206830","Fenster","Stück","2005-12-01","2099-12-31"]
["GGL FK06 2069","Fenster","Stück","2005-12-01","2099-12-31"]
["GGL FK06 206921","Fenster","Stück","2005-12-01","2099-12-31"]
["GGL FK06 206930","Fenster","Stück","2005-12-01","2099-12-31"]
["GGL FK06 2070","Fenster","Stück","2005-12-01","2099-12-31"]
["GGL FK06 207021","Fenster","Stück","2005-12-01","2099-12-31"]
["GGL FK06 207030","Fenster","Stück","2005-12-01","2099-12-31"]
["GGL FK06 2070Q","Fenster","Stück","2005-12-01","2099-12-31"]
["GGL FK06 2084","Fenster","Stück","2005-12-01","2099-12-31"]
["GGL FK06 208421","Fenster","Stück","2005-12-01","2099-12-31"]
["GGL FK06 208430","Fenster","Stück","2005-12-01","2099-12-31"]
["GGL FK06 2184","Fenster","Stück","2005-12-01","2099-12-31"]
["GGL FK06 218421","Fenster","Stück","2005-12-01","2099-12-31"]
["GGL FK06 218430","Fenster","Stück","2005-12-01","2099-12-31"]
["GGL FK06 2384","Fenster","Stück","2005-12-01","2099-12-31"]
["GGL FK06 238430","Fenster","Stück","2005-12-01","2099-12-31"]
["GGL FK06 3062","Fenster","Stück","2005-12-01","2099-12-31"]
["GGL FK06 306221","Fenster","Stück","2005-12-01","2099-12-31"]
["GGL FK06 3062D","Fenster","Stück","2005-12-01","2099-12-31"]
["GGL FK06 3062D21","Fenster","Stück","2005-12-01","2099-12-31"]
["GGL FK06 3066","Fenster","Stück","2005-12-01","2099-12-31"]
["GGL FK06 306621","Fenster","Stück","2005-12-01","2099-12-31"]
["GGL FK06 306630","Fenster","Stück","2005-12-01","2099-12-31"]
["GGL FK06 3067","Fenster","Stück","2005-12-01","2099-12-31"]
["GGL FK06 306721","Fenster","Stück","2005-12-01","2099-12-31"]
["GGL FK06 306730","Fenster","Stück","2005-12-01","2099-12-31"]
["GGL FK06 3068","Fenster","Stück","2005-12-01","2099-12-31"]
["GGL FK06 306821","Fenster","Stück","2005-12-01","2099-12-31"]
["GGL FK06 306830","Fenster","Stück","2005-12-01","2099-12-31"]
["GGL FK06 3069","Fenster","Stück","2005-12-01","2099-12-31"]
["GGL FK06 306921","Fenster","Stück","2005-12-01","2099-12-31"]
["GGL FK06 306930","Fenster","Stück","2005-12-01","2099-12-31"]
["GGL FK06 3070","Fenster","Stück","2005-12-01","2099-12-31"]
["GGL FK06 307021","Fenster","Stück","2005-12-01","2099-12-31"]
["GGL FK06 307030","Fenster","Stück","2005-12-01","2099-12-31"]
["GGL FK06 3070Q","Fenster","Stück","2005-12-01","2099-12-31"]
["GGL FK06 3084","Fenster","Stück","2005-12-01","2099-12-31"]
["GGL FK06 308421","Fenster","Stück","2005-12-01","2099-12-31"]
["GGL FK06 308430","Fenster","Stück","2005-12-01","2099-12-31"]
["GGL FK06 3184","Fenster","Stück","2005-12-01","2099-12-31"]
["GGL FK06 318421","Fenster","Stück","2005-12-01","2099-12-31"]
["GGL FK06 318430","Fenster","Stück","2005-12-01","2099-12-31"]
["GGL FK06 3384","Fenster","Stück","2005-12-01","2099-12-31"]
["GGL FK08 2062","Fenster","Stück","2005-12-01","2099-12-31"]
["GGL FK08 206221","Fenster","Stück","2005-12-01","2099-12-31"]
["GGL FK08 2062D","Fenster","Stück","2005-12-01","2099-12-31"]
["GGL FK08 2062D21","Fenster","Stück","2005-12-01","2099-12-31"]
["GGL FK08 2066","Fenster","Stück","2005-12-01","2099-12-31"]
["GGL FK08 206621","Fenster","Stück","2005-12-01","2099-12-31"]
["GGL FK08 206630","Fenster","Stück","2005-12-01","2099-12-31"]
["GGL FK08 2067","Fenster","Stück","2005-12-01","2099-12-31"]
["GGL FK08 206721","Fenster","Stück","2005-12-01","2099-12-31"]
["GGL FK08 206730","Fenster","Stück","2005-12-01","2099-12-31"]
["GGL FK08 2068","Fenster","Stück","2005-12-01","2099-12-31"]
["GGL FK08 206821","Fenster","Stück","2005-12-01","2099-12-31"]
["GGL FK08 206830","Fenster","Stück","2005-12-01","2099-12-31"]
["GGL FK08 2069","Fenster","Stück","2005-12-01","2099-12-31"]
["GGL FK08 206921","Fenster","Stück","2005-12-01","2099-12-31"]
["GGL FK08 206930","Fenster","Stück","2005-12-01","2099-12-31"]
["GGL FK08 2070","Fenster","Stück","2005-12-01","2099-12-31"]
["GGL FK08 207021","Fenster","Stück","2005-12-01","2099-12-31"]
["GGL FK08 207030","Fenster","Stück","2005-12-01","2099-12-31"]
["GGL FK08 2084","Fenster","Stück","2005-12-01","2099-12-31"]
["GGL FK08 208421","Fenster","Stück","2005-12-01","2099-12-31"]
["GGL FK08 208430","Fenster","Stück","2005-12-01","2099-12-31"]
["GGL FK08 2184","Fenster","Stück","2005-12-01","2099-12-31"]
["GGL FK08 218421","Fenster","Stück","2005-12-01","2099-12-31"]
["GGL FK08 218430","Fenster","Stück","2005-12-01","2099-12-31"]
["GGL FK08 2384","Fenster","Stück","2005-12-01","2099-12-31"]
["GGL FK08 238430","Fenster","Stück","2005-12-01","2099-12-31"]
["GGL FK08 3062","Fenster","Stück","2005-12-01","2099-12-31"]
["GGL FK08 306221","Fenster","Stück","2005-12-01","2099-12-31"]
["GGL FK08 3062D","Fenster","Stück","2005-12-01","2099-12-31"]
["GGL FK08 3062D21","Fenster","Stück","2005-12-01","2099-12-31"]
["GGL FK08 3066","Fenster","Stück","2005-12-01","2099-12-31"]
["GGL FK08 306621","Fenster","Stück","2005-12-01","2099-12-31"]
["GGL FK08 306630","Fenster","Stück","2005-12-01","2099-12-31"]
["GGL FK08 3067","Fenster","Stück","2005-12-01","2099-12-31"]
["GGL FK08 306721","Fenster","Stück","2005-12-01","2099-12-31"]
["GGL FK08 306730","Fenster","Stück","2005-12-01","2099-12-31"]
["GGL FK08 3068","Fenster","Stück","2005-12-01","2099-12-31"]
["GGL FK08 306821","Fenster","Stück","2005-12-01","2099-12-31"]
["GGL FK08 306830","Fenster","Stück","2005-12-01","2099-12-31"]
["GGL FK08 3069","Fenster","Stück","2005-12-01","2099-12-31"]
["GGL FK08 306921","Fenster","Stück","2005-12-01","2099-12-31"]
["GGL FK08 306930","Fenster","Stück","2005-12-01","2099-12-31"]
["GGL FK08 3070","Fenster","Stück","2005-12-01","2099-12-31"]
["GGL FK08 307021","Fenster","Stück","2005-12-01","2099-12-31"]
["GGL FK08 307030","Fenster","Stück","2005-12-01","2099-12-31"]
["GGL FK08 3084","Fenster","Stück","2005-12-01","2099-12-31"]
["GGL FK08 308421","Fenster","Stück","2005-12-01","2099-12-31"]
["GGL FK08 308430","Fenster","Stück","2005-12-01","2099-12-31"]
["GGL FK08 3184","Fenster","Stück","2005-12-01","2099-12-31"]
["GGL MK04 2062","Fenster","Stück","2005-12-01","2099-12-31"]
["GGL MK04 206221","Fenster","Stück","2005-12-01","2099-12-31"]
["GGL MK04 2062D","Fenster","Stück","2005-12-01","2099-12-31"]
["GGL MK04 2062D21","Fenster","Stück","2005-12-01","2099-12-31"]
["GGL MK04 2066","Fenster","Stück","2005-12-01","2099-12-31"]
["GGL MK04 206621","Fenster","Stück","2005-12-01","2099-12-31"]
["GGL MK04 206630","Fenster","Stück","2005-12-01","2099-12-31"]
["GGL MK04 206640D","Fenster","Stück","2005-12-01","2099-12-31"]
["GGL MK04 2067","Fenster","Stück","2005-12-01","2099-12-31"]
["GGL MK04 206721","Fenster","Stück","2005-12-01","2099-12-31"]
["GGL MK04 206730","Fenster","Stück","2005-12-01","2099-12-31"]
["GGL MK04 2068","Fenster","Stück","2005-12-01","2099-12-31"]
["GGL MK04 206821","Fenster","Stück","2005-12-01","2099-12-31"]
["GGL MK04 206830","Fenster","Stück","2005-12-01","2099-12-31"]
["GGL MK04 2069","Fenster","Stück","2005-12-01","2099-12-31"]
["GGL MK04 206921","Fenster","Stück","2005-12-01","2099-12-31"]
["GGL MK04 206930","Fenster","Stück","2005-12-01","2099-12-31"]
["GGL MK04 2070","Fenster","Stück","2005-12-01","2099-12-31"]
["GGL MK04 207021","Fenster","Stück","2005-12-01","2099-12-31"]
["GGL MK04 207030","Fenster","Stück","2005-12-01","2099-12-31"]
["GGL MK04 207040D","Fenster","Stück","2005-12-01","2099-12-31"]
["GGL MK04 2070Q","Fenster","Stück","2005-12-01","2099-12-31"]
["GGL MK04 2084","Fenster","Stück","2005-12-01","2099-12-31"]
["GGL MK04 208421","Fenster","Stück","2005-12-01","2099-12-31"]
["GGL MK04 208430","Fenster","Stück","2005-12-01","2099-12-31"]
["GGL MK04 2184","Fenster","Stück","2005-12-01","2099-12-31"]
["GGL MK04 218421","Fenster","Stück","2005-12-01","2099-12-31"]
["GGL MK04 218430","Fenster","Stück","2005-12-01","2099-12-31"]
["GGL MK04 2384","Fenster","Stück","2005-12-01","2099-12-31"]
["GGL MK04 238430","Fenster","Stück","2005-12-01","2099-12-31"]
["GGL MK04 3062","Fenster","Stück","2005-12-01","2099-12-31"]
["GGL MK04 306221","Fenster","Stück","2005-12-01","2099-12-31"]
["GGL MK04 3062D","Fenster","Stück","2005-12-01","2099-12-31"]
["GGL MK04 3062D21","Fenster","Stück","2005-12-01","2099-12-31"]
["GGL MK04 3066","Fenster","Stück","2005-12-01","2099-12-31"]
["GGL MK04 306621","Fenster","Stück","2005-12-01","2099-12-31"]
["GGL MK04 306630","Fenster","Stück","2005-12-01","2099-12-31"]
["GGL MK04 306640D","Fenster","Stück","2005-12-01","2099-12-31"]
["GGL MK04 3067","Fenster","Stück","2005-12-01","2099-12-31"]
["GGL MK04 306721","Fenster","Stück","2005-12-01","2099-12-31"]
["GGL MK04 306730","Fenster","Stück","2005-12-01","2099-12-31"]
["GGL MK04 3068","Fenster","Stück","2005-12-01","2099-12-31"]
["GGL MK04 306821","Fenster","Stück","2005-12-01","2099-12-31"]
["GGL MK04 306830","Fenster","Stück","2005-12-01","2099-12-31"]
["GGL MK04 3069","Fenster","Stück","2005-12-01","2099-12-31"]
["GGL MK04 306921","Fenster","Stück","2005-12-01","2099-12-31"]
["GGL MK04 306930","Fenster","Stück","2005-12-01","2099-12-31"]
["GGL MK04 3070","Fenster","Stück","2005-12-01","2099-12-31"]
["GGL MK04 307021","Fenster","Stück","2005-12-01","2099-12-31"]
["GGL MK04 307030","Fenster","Stück","2005-12-01","2099-12-31"]
["GGL MK04 307040D","Fenster","Stück","2005-12-01","2099-12-31"]
["GGL MK04 3070Q","Fenster","Stück","2005-12-01","2099-12-31"]
["GGL MK04 3084","Fenster","Stück","2005-12-01","2099-12-31"]
["GGL MK04 308421","Fenster","Stück","2005-12-01","2099-12-31"]
["GGL MK04 308430","Fenster","Stück","2005-12-01","2099-12-31"]
["GGL MK04 3184","Fenster","Stück","2005-12-01","2099-12-31"]
["GGL MK04 318421","Fenster","Stück","2005-12-01","2099-12-31"]
["GGL MK04 318430","Fenster","Stück","2005-12-01","2099-12-31"]
["GGL MK04 3384","Fenster","Stück","2005-12-01","2099-12-31"]
["GGL MK04 338430","Fenster","Stück","2005-12-01","2099-12-31"]
["GGL MK06 2062","Fenster","Stück","2005-12-01","2099-12-31"]
["GGL MK06 206221","Fenster","Stück","2005-12-01","2099-12-31"]
["GGL MK06 2062D","Fenster","Stück","2005-12-01","2099-12-31"]
["GGL MK06 2062D21","Fenster","Stück","2005-12-01","2099-12-31"]
["GGL MK06 2066","Fenster","Stück","2005-12-01","2099-12-31"]
["GGL MK06 206621","Fenster","Stück","2005-12-01","2099-12-31"]
["GGL MK06 206630","Fenster","Stück","2005-12-01","2099-12-31"]
["GGL MK06 206640D","Fenster","Stück","2005-12-01","2099-12-31"]
["GGL MK06 2067","Fenster","Stück","2005-12-01","2099-12-31"]
["GGL MK06 206721","Fenster","Stück","2005-12-01","2099-12-31"]
["GGL MK06 206730","Fenster","Stück","2005-12-01","2099-12-31"]
["GGL MK06 2068","Fenster","Stück","2005-12-01","2099-12-31"]
["GGL MK06 206821","Fenster","Stück","2005-12-01","2099-12-31"]
["GGL MK06 206830","Fenster","Stück","2005-12-01","2099-12-31"]
["GGL MK06 2069","Fenster","Stück","2005-12-01","2099-12-31"]
["GGL MK06 206921","Fenster","Stück","2005-12-01","2099-12-31"]
["GGL MK06 206930","Fenster","Stück","2005-12-01","2099-12-31"]
["GGL MK06 2070","Fenster","Stück","2005-12-01","2099-12-31"]
["GGL MK06 207021","Fenster","Stück","2005-12-01","2099-12-31"]
["GGL MK06 207030","Fenster","Stück","2005-12-01","2099-12-31"]
["GGL MK06 207040D","Fenster","Stück","2005-12-01","2099-12-31"]
["GGL MK06 2070Q","Fenster","Stück","2005-12-01","2099-12-31"]
["GGL MK06 2084","Fenster","Stück","2005-12-01","2099-12-31"]
["GGL MK06 208421","Fenster","Stück","2005-12-01","2099-12-31"]
["GGL MK06 208430","Fenster","Stück","2005-12-01","2099-12-31"]
["GGL MK06 2184","Fenster","Stück","2005-12-01","2099-12-31"]
["GGL MK06 218421","Fenster","Stück","2005-12-01","2099-12-31"]
["GGL MK06 218430","Fenster","Stück","2005-12-01","2099-12-31"]
["GGL MK06 2384","Fenster","Stück","2005-12-01","2099-12-31"]
["GGL MK06 238430","Fenster","Stück","2005-12-01","2099-12-31"]
["GGL MK06 3062","Fenster","Stück","2005-12-01","2099-12-31"]
["GGL MK06 306221","Fenster","Stück","2005-12-01","2099-12-31"]
["GGL MK06 3062D21","Fenster","Stück","2005-12-01","2099-12-31"]
["GGL MK06 3066","Fenster","Stück","2005-12-01","2099-12-31"]
["GGL MK06 306621","Fenster","Stück","2005-12-01","2099-12-31"]
["GGL MK06 306630","Fenster","Stück","2005-12-01","2099-12-31"]
["GGL MK06 306640D","Fenster","Stück","2005-12-01","2099-12-31"]
["GGL MK06 3067","Fenster","Stück","2005-12-01","2099-12-31"]
["GGL MK06 306721","Fenster","Stück","2005-12-01","2099-12-31"]
["GGL MK06 306730","Fenster","Stück","2005-12-01","2099-12-31"]
["GGL MK06 3068","Fenster","Stück","2005-12-01","2099-12-31"]
["GGL MK06 306821","Fenster","Stück","2005-12-01","2099-12-31"]
["GGL MK06 306830","Fenster","Stück","2005-12-01","2099-12-31"]
["GGL MK06 3069","Fenster","Stück","2005-12-01","2099-12-31"]
["GGL MK06 306921","Fenster","Stück","2005-12-01","2099-12-31"]
["GGL MK06 306930","Fenster","Stück","2005-12-01","2099-12-31"]
["GGL MK06 3070","Fenster","Stück","2005-12-01","2099-12-31"]
["GGL MK06 307021","Fenster","Stück","2005-12-01","2099-12-31"]
["GGL MK06 307030","Fenster","Stück","2005-12-01","2099-12-31"]
["GGL MK06 307040D","Fenster","Stück","2005-12-01","2099-12-31"]
["GGL MK06 3070Q","Fenster","Stück","2005-12-01","2099-12-31"]
["GGL MK06 3084","Fenster","Stück","2005-12-01","2099-12-31"]
["GGL MK06 308421","Fenster","Stück","2005-12-01","2099-12-31"]
["GGL MK06 308430","Fenster","Stück","2005-12-01","2099-12-31"]
["GGL MK06 3184","Fenster","Stück","2005-12-01","2099-12-31"]
["GGL MK06 318421","Fenster","Stück","2005-12-01","2099-12-31"]
["GGL MK06 318430","Fenster","Stück","2005-12-01","2099-12-31"]
["GGL MK06 3384","Fenster","Stück","2005-12-01","2099-12-31"]
["GGL MK08 2062","Fenster","Stück","2005-12-01","2099-12-31"]
["GGL MK08 206221","Fenster","Stück","2005-12-01","2099-12-31"]
["GGL MK08 2062D","Fenster","Stück","2005-12-01","2099-12-31"]
["GGL MK08 2062D21","Fenster","Stück","2005-12-01","2099-12-31"]
["GGL MK08 2066","Fenster","Stück","2005-12-01","2099-12-31"]
["GGL MK08 206621","Fenster","Stück","2005-12-01","2099-12-31"]
["GGL MK08 206630","Fenster","Stück","2005-12-01","2099-12-31"]
["GGL MK08 206640D","Fenster","Stück","2005-12-01","2099-12-31"]
["GGL MK08 2067","Fenster","Stück","2005-12-01","2099-12-31"]
["GGL MK08 206721","Fenster","Stück","2005-12-01","2099-12-31"]
["GGL MK08 206730","Fenster","Stück","2005-12-01","2099-12-31"]
["GGL MK08 2068","Fenster","Stück","2005-12-01","2099-12-31"]
["GGL MK08 206821","Fenster","Stück","2005-12-01","2099-12-31"]
["GGL MK08 206830","Fenster","Stück","2005-12-01","2099-12-31"]
["GGL MK08 2069","Fenster","Stück","2005-12-01","2099-12-31"]
["GGL MK08 206921","Fenster","Stück","2005-12-01","2099-12-31"]
["GGL MK08 206930","Fenster","Stück","2005-12-01","2099-12-31"]
["GGL MK08 2070","Fenster","Stück","2005-12-01","2099-12-31"]
["GGL MK08 207021","Fenster","Stück","2005-12-01","2099-12-31"]
["GGL MK08 207030","Fenster","Stück","2005-12-01","2099-12-31"]
["GGL MK08 207040D","Fenster","Stück","2005-12-01","2099-12-31"]
["GGL MK08 2070Q","Fenster","Stück","2005-12-01","2099-12-31"]
["GGL MK08 2084","Fenster","Stück","2005-12-01","2099-12-31"]
["GGL MK08 208421","Fenster","Stück","2005-12-01","2099-12-31"]
["GGL MK08 208430","Fenster","Stück","2005-12-01","2099-12-31"]
["GGL MK08 2184","Fenster","Stück","2005-12-01","2099-12-31"]
["GGL MK08 218421","Fenster","Stück","2005-12-01","2099-12-31"]
["GGL MK08 218430","Fenster","Stück","2005-12-01","2099-12-31"]
["GGL MK08 2384","Fenster","Stück","2005-12-01","2099-12-31"]
["GGL MK08 238430","Fenster","Stück","2005-12-01","2099-12-31"]
["GGL MK08 3062","Fenster","Stück","2005-12-01","2099-12-31"]
["GGL MK08 306221","Fenster","Stück","2005-12-01","2099-12-31"]
["GGL MK08 3062D","Fenster","Stück","2005-12-01","2099-12-31"]
["GGL MK08 3066","Fenster","Stück","2005-12-01","2099-12-31"]
["GGL MK08 306621","Fenster","Stück","2005-12-01","2099-12-31"]
["GGL MK08 306630","Fenster","Stück","2005-12-01","2099-12-31"]
["GGL MK08 306640D","Fenster","Stück","2005-12-01","2099-12-31"]
["GGL MK08 3067","Fenster","Stück","2005-12-01","2099-12-31"]
["GGL MK08 306721","Fenster","Stück","2005-12-01","2099-12-31"]
["GGL MK08 306730","Fenster","Stück","2005-12-01","2099-12-31"]
["GGL MK08 3068","Fenster","Stück","2005-12-01","2099-12-31"]
["GGL MK08 306821","Fenster","Stück","2005-12-01","2099-12-31"]
["GGL MK08 306830","Fenster","Stück","2005-12-01","2099-12-31"]
["GGL MK08 3069","Fenster","Stück","2005-12-01","2099-12-31"]
["GGL MK08 306921","Fenster","Stück","2005-12-01","2099-12-31"]
["GGL MK08 306930","Fenster","Stück","2005-12-01","2099-12-31"]
["GGL MK08 3070","Fenster","Stück","2005-12-01","2099-12-31"]
["GGL MK08 307021","Fenster","Stück","2005-12-01","2099-12-31"]
["GGL MK08 307030","Fenster","Stück","2005-12-01","2099-12-31"]
["GGL MK08 307040D","Fenster","Stück","2005-12-01","2099-12-31"]
["GGL MK08 3070Q","Fenster","Stück","2005-12-01","2099-12-31"]
["GGL MK08 3084","Fenster","Stück","2005-12-01","2099-12-31"]
["GGL MK08 308421","Fenster","Stück","2005-12-01","2099-12-31"]
["GGL MK08 308430","Fenster","Stück","2005-12-01","2099-12-31"]
["GGL MK08 3184","Fenster","Stück","2005-12-01","2099-12-31"]
["GGL MK08 318421","Fenster","Stück","2005-12-01","2099-12-31"]
["GGL MK08 318430","Fenster","Stück","2005-12-01","2099-12-31"]
["GGL MK08 3384","Fenster","Stück","2005-12-01","2099-12-31"]
["GGL MK08 338430","Fenster","Stück","2005-12-01","2099-12-31"]
["GGL MK10 2062","Fenster","Stück","2005-12-01","2099-12-31"]
["GGL MK10 206221","Fenster","Stück","2005-12-01","2099-12-31"]
["GGL MK10 2066","Fenster","Stück","2005-12-01","2099-12-31"]
["GGL MK10 206621","Fenster","Stück","2005-12-01","2099-12-31"]
["GGL MK10 206630","Fenster","Stück","2005-12-01","2099-12-31"]
["GGL MK10 2067","Fenster","Stück","2005-12-01","2099-12-31"]
["GGL MK10 206721","Fenster","Stück","2005-12-01","2099-12-31"]
["GGL MK10 2068","Fenster","Stück","2005-12-01","2099-12-31"]
["GGL MK10 206821","Fenster","Stück","2005-12-01","2099-12-31"]
["GGL MK10 2069","Fenster","Stück","2005-12-01","2099-12-31"]
["GGL MK10 206921","Fenster","Stück","2005-12-01","2099-12-31"]
["GGL MK10 2070","Fenster","Stück","2005-12-01","2099-12-31"]
["GGL MK10 207021","Fenster","Stück","2005-12-01","2099-12-31"]
["GGL MK10 207030","Fenster","Stück","2005-12-01","2099-12-31"]
["GGL MK10 2070Q","Fenster","Stück","2005-12-01","2099-12-31"]
["GGL MK10 2084","Fenster","Stück","2005-12-01","2099-12-31"]
["GGL MK10 208421","Fenster","Stück","2005-12-01","2099-12-31"]
["GGL MK10 208430","Fenster","Stück","2005-12-01","2099-12-31"]
["GGL MK10 2184","Fenster","Stück","2005-12-01","2099-12-31"]
["GGL MK10 218421","Fenster","Stück","2005-12-01","2099-12-31"]
["GGL MK10 218430","Fenster","Stück","2005-12-01","2099-12-31"]
["GGL MK10 2384","Fenster","Stück","2005-12-01","2099-12-31"]
["GGL MK10 238430","Fenster","Stück","2005-12-01","2099-12-31"]
["GGL MK10 3062","Fenster","Stück","2005-12-01","2099-12-31"]
["GGL MK10 306221","Fenster","Stück","2005-12-01","2099-12-31"]
["GGL MK10 3066","Fenster","Stück","2005-12-01","2099-12-31"]
["GGL MK10 306621","Fenster","Stück","2005-12-01","2099-12-31"]
["GGL MK10 306630","Fenster","Stück","2005-12-01","2099-12-31"]
["GGL MK10 3067","Fenster","Stück","2005-12-01","2099-12-31"]
["GGL MK10 306721","Fenster","Stück","2005-12-01","2099-12-31"]
["GGL MK10 3068","Fenster","Stück","2005-12-01","2099-12-31"]
["GGL MK10 306821","Fenster","Stück","2005-12-01","2099-12-31"]
["GGL MK10 3069","Fenster","Stück","2005-12-01","2099-12-31"]
["GGL MK10 306921","Fenster","Stück","2005-12-01","2099-12-31"]
["GGL MK10 3070","Fenster","Stück","2005-12-01","2099-12-31"]
["GGL MK10 307021","Fenster","Stück","2005-12-01","2099-12-31"]
["GGL MK10 307030","Fenster","Stück","2005-12-01","2099-12-31"]
["GGL MK10 3070Q","Fenster","Stück","2005-12-01","2099-12-31"]
["GGL MK10 3084","Fenster","Stück","2005-12-01","2099-12-31"]
["GGL MK10 308421","Fenster","Stück","2005-12-01","2099-12-31"]
["GGL MK10 308430","Fenster","Stück","2005-12-01","2099-12-31"]
["GGL MK10 3184","Fenster","Stück","2005-12-01","2099-12-31"]
["GGL MK12 2066","Fenster","Stück","2005-12-01","2099-12-31"]
["GGL MK12 206621","Fenster","Stück","2005-12-01","2099-12-31"]
["GGL MK12 2067","Fenster","Stück","2005-12-01","2099-12-31"]
["GGL MK12 2068","Fenster","Stück","2005-12-01","2099-12-31"]
["GGL MK12 206821","Fenster","Stück","2005-12-01","2099-12-31"]
["GGL MK12 2069","Fenster","Stück","2005-12-01","2099-12-31"]
["GGL MK12 2070","Fenster","Stück","2005-12-01","2099-12-31"]
["GGL MK12 2084","Fenster","Stück","2005-12-01","2099-12-31"]
["GGL MK12 208421","Fenster","Stück","2005-12-01","2099-12-31"]
["GGL MK12 3066","Fenster","Stück","2005-12-01","2099-12-31"]
["GGL MK12 3067","Fenster","Stück","2005-12-01","2099-12-31"]
["GGL MK12 3068","Fenster","Stück","2005-12-01","2099-12-31"]
["GGL MK12 3069","Fenster","Stück","2005-12-01","2099-12-31"]
["GGL MK12 3070","Fenster","Stück","2005-12-01","2099-12-31"]
["GGL MK12 3084","Fenster","Stück","2005-12-01","2099-12-31"]
["GGL PK06 2062","Fenster","Stück","2005-12-01","2099-12-31"]
["GGL PK06 206221","Fenster","Stück","2005-12-01","2099-12-31"]
["GGL PK06 2066","Fenster","Stück","2005-12-01","2099-12-31"]
["GGL PK06 206621","Fenster","Stück","2005-12-01","2099-12-31"]
["GGL PK06 206640D","Fenster","Stück","2005-12-01","2099-12-31"]
["GGL PK06 2067","Fenster","Stück","2005-12-01","2099-12-31"]
["GGL PK06 206721","Fenster","Stück","2005-12-01","2099-12-31"]
["GGL PK06 206730","Fenster","Stück","2005-12-01","2099-12-31"]
["GGL PK06 2068","Fenster","Stück","2005-12-01","2099-12-31"]
["GGL PK06 206821","Fenster","Stück","2005-12-01","2099-12-31"]
["GGL PK06 206830","Fenster","Stück","2005-12-01","2099-12-31"]
["GGL PK06 2069","Fenster","Stück","2005-12-01","2099-12-31"]
["GGL PK06 206921","Fenster","Stück","2005-12-01","2099-12-31"]
["GGL PK06 206930","Fenster","Stück","2005-12-01","2099-12-31"]
["GGL PK06 2070","Fenster","Stück","2005-12-01","2099-12-31"]
["GGL PK06 207021","Fenster","Stück","2005-12-01","2099-12-31"]
["GGL PK06 207030","Fenster","Stück","2005-12-01","2099-12-31"]
["GGL PK06 207040D","Fenster","Stück","2005-12-01","2099-12-31"]
["GGL PK06 2070Q","Fenster","Stück","2005-12-01","2099-12-31"]
["GGL PK06 2084","Fenster","Stück","2005-12-01","2099-12-31"]
["GGL PK06 208421","Fenster","Stück","2005-12-01","2099-12-31"]
["GGL PK06 208430","Fenster","Stück","2005-12-01","2099-12-31"]
["GGL PK06 2184","Fenster","Stück","2005-12-01","2099-12-31"]
["GGL PK06 218421","Fenster","Stück","2005-12-01","2099-12-31"]
["GGL PK06 2384","Fenster","Stück","2005-12-01","2099-12-31"]
["GGL PK06 3062","Fenster","Stück","2005-12-01","2099-12-31"]
["GGL PK06 306221","Fenster","Stück","2005-12-01","2099-12-31"]
["GGL PK06 3066","Fenster","Stück","2005-12-01","2099-12-31"]
["GGL PK06 306621","Fenster","Stück","2005-12-01","2099-12-31"]
["GGL PK06 306640D","Fenster","Stück","2005-12-01","2099-12-31"]
["GGL PK06 3067","Fenster","Stück","2005-12-01","2099-12-31"]
["GGL PK06 306721","Fenster","Stück","2005-12-01","2099-12-31"]
["GGL PK06 306730","Fenster","Stück","2005-12-01","2099-12-31"]
["GGL PK06 3068","Fenster","Stück","2005-12-01","2099-12-31"]
["GGL PK06 306821","Fenster","Stück","2005-12-01","2099-12-31"]
["GGL PK06 306830","Fenster","Stück","2005-12-01","2099-12-31"]
["GGL PK06 3069","Fenster","Stück","2005-12-01","2099-12-31"]
["GGL PK06 306921","Fenster","Stück","2005-12-01","2099-12-31"]
["GGL PK06 306930","Fenster","Stück","2005-12-01","2099-12-31"]
["GGL PK06 3070","Fenster","Stück","2005-12-01","2099-12-31"]
["GGL PK06 307021","Fenster","Stück","2005-12-01","2099-12-31"]
["GGL PK06 307030","Fenster","Stück","2005-12-01","2099-12-31"]
["GGL PK06 307040D","Fenster","Stück","2005-12-01","2099-12-31"]
["GGL PK06 3070Q","Fenster","Stück","2005-12-01","2099-12-31"]
["GGL PK06 3084","Fenster","Stück","2005-12-01","2099-12-31"]
["GGL PK06 308421","Fenster","Stück","2005-12-01","2099-12-31"]
["GGL PK06 308430","Fenster","Stück","2005-12-01","2099-12-31"]
["GGL PK06 3184","Fenster","Stück","2005-12-01","2099-12-31"]
["GGL PK06 318421","Fenster","Stück","2005-12-01","2099-12-31"]
["GGL PK06 318430","Fenster","Stück","2005-12-01","2099-12-31"]
["GGL PK06 SD00402","Fenster","Stück","2005-12-01","2099-12-31"]
["GGL PK06 SD00403","Fenster","Stück","2005-12-01","2099-12-31"]
["GGL PK06 SD00404","Fenster","Stück","2005-12-01","2099-12-31"]
["GGL PK06 SD00405","Fenster","Stück","2005-12-01","2099-12-31"]
["GGL PK08 2062","Fenster","Stück","2005-12-01","2099-12-31"]
["GGL PK08 206221","Fenster","Stück","2005-12-01","2099-12-31"]
["GGL PK08 2066","Fenster","Stück","2005-12-01","2099-12-31"]
["GGL PK08 206621","Fenster","Stück","2005-12-01","2099-12-31"]
["GGL PK08 206630","Fenster","Stück","2005-12-01","2099-12-31"]
["GGL PK08 206640D","Fenster","Stück","2005-12-01","2099-12-31"]
["GGL PK08 2067","Fenster","Stück","2005-12-01","2099-12-31"]
["GGL PK08 206721","Fenster","Stück","2005-12-01","2099-12-31"]
["GGL PK08 2068","Fenster","Stück","2005-12-01","2099-12-31"]
["GGL PK08 206821","Fenster","Stück","2005-12-01","2099-12-31"]
["GGL PK08 2069","Fenster","Stück","2005-12-01","2099-12-31"]
["GGL PK08 206921","Fenster","Stück","2005-12-01","2099-12-31"]
["GGL PK08 2070","Fenster","Stück","2005-12-01","2099-12-31"]
["GGL PK08 207021","Fenster","Stück","2005-12-01","2099-12-31"]
["GGL PK08 207030","Fenster","Stück","2005-12-01","2099-12-31"]
["GGL PK08 207040D","Fenster","Stück","2005-12-01","2099-12-31"]
["GGL PK08 2070Q","Fenster","Stück","2005-12-01","2099-12-31"]
["GGL PK08 2084","Fenster","Stück","2005-12-01","2099-12-31"]
["GGL PK08 208421","Fenster","Stück","2005-12-01","2099-12-31"]
["GGL PK08 208430","Fenster","Stück","2005-12-01","2099-12-31"]
["GGL PK08 2184","Fenster","Stück","2005-12-01","2099-12-31"]
["GGL PK08 218421","Fenster","Stück","2005-12-01","2099-12-31"]
["GGL PK08 2384","Fenster","Stück","2005-12-01","2099-12-31"]
["GGL PK08 3062","Fenster","Stück","2005-12-01","2099-12-31"]
["GGL PK08 306221","Fenster","Stück","2005-12-01","2099-12-31"]
["GGL PK08 3066","Fenster","Stück","2005-12-01","2099-12-31"]
["GGL PK08 306621","Fenster","Stück","2005-12-01","2099-12-31"]
["GGL PK08 306630","Fenster","Stück","2005-12-01","2099-12-31"]
["GGL PK08 306640D","Fenster","Stück","2005-12-01","2099-12-31"]
["GGL PK08 3067","Fenster","Stück","2005-12-01","2099-12-31"]
["GGL PK08 306721","Fenster","Stück","2005-12-01","2099-12-31"]
["GGL PK08 3068","Fenster","Stück","2005-12-01","2099-12-31"]
["GGL PK08 306821","Fenster","Stück","2005-12-01","2099-12-31"]
["GGL PK08 3069","Fenster","Stück","2005-12-01","2099-12-31"]
["GGL PK08 306921","Fenster","Stück","2005-12-01","2099-12-31"]
["GGL PK08 3070","Fenster","Stück","2005-12-01","2099-12-31"]
["GGL PK08 307021","Fenster","Stück","2005-12-01","2099-12-31"]
["GGL PK08 307030","Fenster","Stück","2005-12-01","2099-12-31"]
["GGL PK08 307040D","Fenster","Stück","2005-12-01","2099-12-31"]
["GGL PK08 3070Q","Fenster","Stück","2005-12-01","2099-12-31"]
["GGL PK08 3084","Fenster","Stück","2005-12-01","2099-12-31"]
["GGL PK08 308421","Fenster","Stück","2005-12-01","2099-12-31"]
["GGL PK08 308430","Fenster","Stück","2005-12-01","2099-12-31"]
["GGL PK08 3184","Fenster","Stück","2005-12-01","2099-12-31"]
["GGL PK08 SD00402","Fenster","Stück","2005-12-01","2099-12-31"]
["GGL PK08 SD00403","Fenster","Stück","2005-12-01","2099-12-31"]
["GGL PK08 SD00404","Fenster","Stück","2005-12-01","2099-12-31"]
["GGL PK08 SD00405","Fenster","Stück","2005-12-01","2099-12-31"]
["GGL PK10 2062","Fenster","Stück","2005-12-01","2099-12-31"]
["GGL PK10 206221","Fenster","Stück","2005-12-01","2099-12-31"]
["GGL PK10 2066","Fenster","Stück","2005-12-01","2099-12-31"]
["GGL PK10 206621","Fenster","Stück","2005-12-01","2099-12-31"]
["GGL PK10 206630","Fenster","Stück","2005-12-01","2099-12-31"]
["GGL PK10 2067","Fenster","Stück","2005-12-01","2099-12-31"]
["GGL PK10 206721","Fenster","Stück","2005-12-01","2099-12-31"]
["GGL PK10 206730","Fenster","Stück","2005-12-01","2099-12-31"]
["GGL PK10 2068","Fenster","Stück","2005-12-01","2099-12-31"]
["GGL PK10 206821","Fenster","Stück","2005-12-01","2099-12-31"]
["GGL PK10 206830","Fenster","Stück","2005-12-01","2099-12-31"]
["GGL PK10 2069","Fenster","Stück","2005-12-01","2099-12-31"]
["GGL PK10 206921","Fenster","Stück","2005-12-01","2099-12-31"]
["GGL PK10 206930","Fenster","Stück","2005-12-01","2099-12-31"]
["GGL PK10 2070","Fenster","Stück","2005-12-01","2099-12-31"]
["GGL PK10 207021","Fenster","Stück","2005-12-01","2099-12-31"]
["GGL PK10 207030","Fenster","Stück","2005-12-01","2099-12-31"]
["GGL PK10 2070Q","Fenster","Stück","2005-12-01","2099-12-31"]
["GGL PK10 2084","Fenster","Stück","2005-12-01","2099-12-31"]
["GGL PK10 208421","Fenster","Stück","2005-12-01","2099-12-31"]
["GGL PK10 208430","Fenster","Stück","2005-12-01","2099-12-31"]
["GGL PK10 2184","Fenster","Stück","2005-12-01","2099-12-31"]
["GGL PK10 218421","Fenster","Stück","2005-12-01","2099-12-31"]
["GGL PK10 218430","Fenster","Stück","2005-12-01","2099-12-31"]
["GGL PK10 2384","Fenster","Stück","2005-12-01","2099-12-31"]
["GGL PK10 238430","Fenster","Stück","2005-12-01","2099-12-31"]
["GGL PK10 3062","Fenster","Stück","2005-12-01","2099-12-31"]
["GGL PK10 306221","Fenster","Stück","2005-12-01","2099-12-31"]
["GGL PK10 3066","Fenster","Stück","2005-12-01","2099-12-31"]
["GGL PK10 306621","Fenster","Stück","2005-12-01","2099-12-31"]
["GGL PK10 306630","Fenster","Stück","2005-12-01","2099-12-31"]
["GGL PK10 3067","Fenster","Stück","2005-12-01","2099-12-31"]
["GGL PK10 306721","Fenster","Stück","2005-12-01","2099-12-31"]
["GGL PK10 306730","Fenster","Stück","2005-12-01","2099-12-31"]
["GGL PK10 3068","Fenster","Stück","2005-12-01","2099-12-31"]
["GGL PK10 306821","Fenster","Stück","2005-12-01","2099-12-31"]
["GGL PK10 306830","Fenster","Stück","2005-12-01","2099-12-31"]
["GGL PK10 3069","Fenster","Stück","2005-12-01","2099-12-31"]
["GGL PK10 306921","Fenster","Stück","2005-12-01","2099-12-31"]
["GGL PK10 306930","Fenster","Stück","2005-12-01","2099-12-31"]
["GGL PK10 3070","Fenster","Stück","2005-12-01","2099-12-31"]
["GGL PK10 307021","Fenster","Stück","2005-12-01","2099-12-31"]
["GGL PK10 307030","Fenster","Stück","2005-12-01","2099-12-31"]
["GGL PK10 3070Q","Fenster","Stück","2005-12-01","2099-12-31"]
["GGL PK10 3084","Fenster","Stück","2005-12-01","2099-12-31"]
["GGL PK10 308421","Fenster","Stück","2005-12-01","2099-12-31"]
["GGL PK10 308430","Fenster","Stück","2005-12-01","2099-12-31"]
["GGL PK10 3184","Fenster","Stück","2005-12-01","2099-12-31"]
["GGL PK10 318421","Fenster","Stück","2005-12-01","2099-12-31"]
["GGL PK10 318430","Fenster","Stück","2005-12-01","2099-12-31"]
["GGL PK10 3384","Fenster","Stück","2005-12-01","2099-12-31"]
["GGL SK06 2062","Fenster","Stück","2005-12-01","2099-12-31"]
["GGL SK06 206221","Fenster","Stück","2005-12-01","2099-12-31"]
["GGL SK06 2062D","Fenster","Stück","2005-12-01","2099-12-31"]
["GGL SK06 2062D21","Fenster","Stück","2005-12-01","2099-12-31"]
["GGL SK06 2066","Fenster","Stück","2005-12-01","2099-12-31"]
["GGL SK06 206621","Fenster","Stück","2005-12-01","2099-12-31"]
["GGL SK06 206630","Fenster","Stück","2005-12-01","2099-12-31"]
["GGL SK06 206640D","Fenster","Stück","2005-12-01","2099-12-31"]
["GGL SK06 2067","Fenster","Stück","2005-12-01","2099-12-31"]
["GGL SK06 206721","Fenster","Stück","2005-12-01","2099-12-31"]
["GGL SK06 206730","Fenster","Stück","2005-12-01","2099-12-31"]
["GGL SK06 2068","Fenster","Stück","2005-12-01","2099-12-31"]
["GGL SK06 206821","Fenster","Stück","2005-12-01","2099-12-31"]
["GGL SK06 206830","Fenster","Stück","2005-12-01","2099-12-31"]
["GGL SK06 2069","Fenster","Stück","2005-12-01","2099-12-31"]
["GGL SK06 206921","Fenster","Stück","2005-12-01","2099-12-31"]
["GGL SK06 206930","Fenster","Stück","2005-12-01","2099-12-31"]
["GGL SK06 2070","Fenster","Stück","2005-12-01","2099-12-31"]
["GGL SK06 207021","Fenster","Stück","2005-12-01","2099-12-31"]
["GGL SK06 207030","Fenster","Stück","2005-12-01","2099-12-31"]
["GGL SK06 207040D","Fenster","Stück","2005-12-01","2099-12-31"]
["GGL SK06 2070Q","Fenster","Stück","2005-12-01","2099-12-31"]
["GGL SK06 2084","Fenster","Stück","2005-12-01","2099-12-31"]
["GGL SK06 208421","Fenster","Stück","2005-12-01","2099-12-31"]
["GGL SK06 208430","Fenster","Stück","2005-12-01","2099-12-31"]
["GGL SK06 2184","Fenster","Stück","2005-12-01","2099-12-31"]
["GGL SK06 218421","Fenster","Stück","2005-12-01","2099-12-31"]
["GGL SK06 218430","Fenster","Stück","2005-12-01","2099-12-31"]
["GGL SK06 2384","Fenster","Stück","2005-12-01","2099-12-31"]
["GGL SK06 238430","Fenster","Stück","2005-12-01","2099-12-31"]
["GGL SK06 3062","Fenster","Stück","2005-12-01","2099-12-31"]
["GGL SK06 306221","Fenster","Stück","2005-12-01","2099-12-31"]
["GGL SK06 3062D","Fenster","Stück","2005-12-01","2099-12-31"]
["GGL SK06 3062D21","Fenster","Stück","2005-12-01","2099-12-31"]
["GGL SK06 3066","Fenster","Stück","2005-12-01","2099-12-31"]
["GGL SK06 306621","Fenster","Stück","2005-12-01","2099-12-31"]
["GGL SK06 306630","Fenster","Stück","2005-12-01","2099-12-31"]
["GGL SK06 306640D","Fenster","Stück","2005-12-01","2099-12-31"]
["GGL SK06 3067","Fenster","Stück","2005-12-01","2099-12-31"]
["GGL SK06 306721","Fenster","Stück","2005-12-01","2099-12-31"]
["GGL SK06 306730","Fenster","Stück","2005-12-01","2099-12-31"]
["GGL SK06 3068","Fenster","Stück","2005-12-01","2099-12-31"]
["GGL SK06 306821","Fenster","Stück","2005-12-01","2099-12-31"]
["GGL SK06 306830","Fenster","Stück","2005-12-01","2099-12-31"]
["GGL SK06 3069","Fenster","Stück","2005-12-01","2099-12-31"]
["GGL SK06 306921","Fenster","Stück","2005-12-01","2099-12-31"]
["GGL SK06 306930","Fenster","Stück","2005-12-01","2099-12-31"]
["GGL SK06 3070","Fenster","Stück","2005-12-01","2099-12-31"]
["GGL SK06 307021","Fenster","Stück","2005-12-01","2099-12-31"]
["GGL SK06 307030","Fenster","Stück","2005-12-01","2099-12-31"]
["GGL SK06 307040D","Fenster","Stück","2005-12-01","2099-12-31"]
["GGL SK06 3070Q","Fenster","Stück","2005-12-01","2099-12-31"]
["GGL SK06 3084","Fenster","Stück","2005-12-01","2099-12-31"]
["GGL SK06 308421","Fenster","Stück","2005-12-01","2099-12-31"]
["GGL SK06 308430","Fenster","Stück","2005-12-01","2099-12-31"]
["GGL SK06 3184","Fenster","Stück","2005-12-01","2099-12-31"]
["GGL SK06 318421","Fenster","Stück","2005-12-01","2099-12-31"]
["GGL SK06 318430","Fenster","Stück","2005-12-01","2099-12-31"]
["GGL SK08 2062","Fenster","Stück","2005-12-01","2099-12-31"]
["GGL SK08 206221","Fenster","Stück","2005-12-01","2099-12-31"]
["GGL SK08 2062D","Fenster","Stück","2005-12-01","2099-12-31"]
["GGL SK08 2062D21","Fenster","Stück","2005-12-01","2099-12-31"]
["GGL SK08 2066","Fenster","Stück","2005-12-01","2099-12-31"]
["GGL SK08 206621","Fenster","Stück","2005-12-01","2099-12-31"]
["GGL SK08 206640D","Fenster","Stück","2005-12-01","2099-12-31"]
["GGL SK08 2067","Fenster","Stück","2005-12-01","2099-12-31"]
["GGL SK08 206721","Fenster","Stück","2005-12-01","2099-12-31"]
["GGL SK08 206730","Fenster","Stück","2005-12-01","2099-12-31"]
["GGL SK08 2068","Fenster","Stück","2005-12-01","2099-12-31"]
["GGL SK08 206821","Fenster","Stück","2005-12-01","2099-12-31"]
["GGL SK08 206830","Fenster","Stück","2005-12-01","2099-12-31"]
["GGL SK08 2069","Fenster","Stück","2005-12-01","2099-12-31"]
["GGL SK08 206921","Fenster","Stück","2005-12-01","2099-12-31"]
["GGL SK08 206930","Fenster","Stück","2005-12-01","2099-12-31"]
["GGL SK08 2070","Fenster","Stück","2005-12-01","2099-12-31"]
["GGL SK08 207021","Fenster","Stück","2005-12-01","2099-12-31"]
["GGL SK08 207030","Fenster","Stück","2005-12-01","2099-12-31"]
["GGL SK08 207040D","Fenster","Stück","2005-12-01","2099-12-31"]
["GGL SK08 2070Q","Fenster","Stück","2005-12-01","2099-12-31"]
["GGL SK08 2084","Fenster","Stück","2005-12-01","2099-12-31"]
["GGL SK08 208421","Fenster","Stück","2005-12-01","2099-12-31"]
["GGL SK08 208430","Fenster","Stück","2005-12-01","2099-12-31"]
["GGL SK08 2184","Fenster","Stück","2005-12-01","2099-12-31"]
["GGL SK08 218421","Fenster","Stück","2005-12-01","2099-12-31"]
["GGL SK08 2384","Fenster","Stück","2005-12-01","2099-12-31"]
["GGL SK08 3062","Fenster","Stück","2005-12-01","2099-12-31"]
["GGL SK08 306221","Fenster","Stück","2005-12-01","2099-12-31"]
["GGL SK08 3062D","Fenster","Stück","2005-12-01","2099-12-31"]
["GGL SK08 3062D21","Fenster","Stück","2005-12-01","2099-12-31"]
["GGL SK08 3066","Fenster","Stück","2005-12-01","2099-12-31"]
["GGL SK08 306621","Fenster","Stück","2005-12-01","2099-12-31"]
["GGL SK08 306640D","Fenster","Stück","2005-12-01","2099-12-31"]
["GGL SK08 3067","Fenster","Stück","2005-12-01","2099-12-31"]
["GGL SK08 306721","Fenster","Stück","2005-12-01","2099-12-31"]
["GGL SK08 306730","Fenster","Stück","2005-12-01","2099-12-31"]
["GGL SK08 3068","Fenster","Stück","2005-12-01","2099-12-31"]
["GGL SK08 306821","Fenster","Stück","2005-12-01","2099-12-31"]
["GGL SK08 306830","Fenster","Stück","2005-12-01","2099-12-31"]
["GGL SK08 3069","Fenster","Stück","2005-12-01","2099-12-31"]
["GGL SK08 306921","Fenster","Stück","2005-12-01","2099-12-31"]
["GGL SK08 306930","Fenster","Stück","2005-12-01","2099-12-31"]
["GGL SK08 3070","Fenster","Stück","2005-12-01","2099-12-31"]
["GGL SK08 307021","Fenster","Stück","2005-12-01","2099-12-31"]
["GGL SK08 307030","Fenster","Stück","2005-12-01","2099-12-31"]
["GGL SK08 307040D","Fenster","Stück","2005-12-01","2099-12-31"]
["GGL SK08 3070Q","Fenster","Stück","2005-12-01","2099-12-31"]
["GGL SK08 3084","Fenster","Stück","2005-12-01","2099-12-31"]
["GGL SK08 308421","Fenster","Stück","2005-12-01","2099-12-31"]
["GGL SK08 308430","Fenster","Stück","2005-12-01","2099-12-31"]
["GGL SK08 3184","Fenster","Stück","2005-12-01","2099-12-31"]
["GGL SK08 318421","Fenster","Stück","2005-12-01","2099-12-31"]
["GGL SK10 2066","Fenster","Stück","2005-12-01","2099-12-31"]
["GGL SK10 206621","Fenster","Stück","2005-12-01","2099-12-31"]
["GGL SK10 2067","Fenster","Stück","2005-12-01","2099-12-31"]
["GGL SK10 206721","Fenster","Stück","2005-12-01","2099-12-31"]
["GGL SK10 2068","Fenster","Stück","2005-12-01","2099-12-31"]
["GGL SK10 206821","Fenster","Stück","2005-12-01","2099-12-31"]
["GGL SK10 2069","Fenster","Stück","2005-12-01","2099-12-31"]
["GGL SK10 206921","Fenster","Stück","2005-12-01","2099-12-31"]
["GGL SK10 2070","Fenster","Stück","2005-12-01","2099-12-31"]
["GGL SK10 207021","Fenster","Stück","2005-12-01","2099-12-31"]
["GGL SK10 207030","Fenster","Stück","2005-12-01","2099-12-31"]
["GGL SK10 2070Q","Fenster","Stück","2005-12-01","2099-12-31"]
["GGL SK10 2084","Fenster","Stück","2005-12-01","2099-12-31"]
["GGL SK10 208421","Fenster","Stück","2005-12-01","2099-12-31"]
["GGL SK10 208430","Fenster","Stück","2005-12-01","2099-12-31"]
["GGL SK10 2184","Fenster","Stück","2005-12-01","2099-12-31"]
["GGL SK10 218421","Fenster","Stück","2005-12-01","2099-12-31"]
["GGL SK10 2384","Fenster","Stück","2005-12-01","2099-12-31"]
["GGL SK10 3066","Fenster","Stück","2005-12-01","2099-12-31"]
["GGL SK10 306621","Fenster","Stück","2005-12-01","2099-12-31"]
["GGL SK10 3067","Fenster","Stück","2005-12-01","2099-12-31"]
["GGL SK10 306721","Fenster","Stück","2005-12-01","2099-12-31"]
["GGL SK10 3068","Fenster","Stück","2005-12-01","2099-12-31"]
["GGL SK10 306821","Fenster","Stück","2005-12-01","2099-12-31"]
["GGL SK10 3069","Fenster","Stück","2005-12-01","2099-12-31"]
["GGL SK10 306921","Fenster","Stück","2005-12-01","2099-12-31"]
["GGL SK10 3070","Fenster","Stück","2005-12-01","2099-12-31"]
["GGL SK10 307021","Fenster","Stück","2005-12-01","2099-12-31"]
["GGL SK10 307030","Fenster","Stück","2005-12-01","2099-12-31"]
["GGL SK10 3070Q","Fenster","Stück","2005-12-01","2099-12-31"]
["GGL SK10 3084","Fenster","Stück","2005-12-01","2099-12-31"]
["GGL SK10 308421","Fenster","Stück","2005-12-01","2099-12-31"]
["GGL SK10 308430","Fenster","Stück","2005-12-01","2099-12-31"]
["GGL SK10 3184","Fenster","Stück","2005-12-01","2099-12-31"]
["GGL SK10 318421","Fenster","Stück","2005-12-01","2099-12-31"]
["GGL UK04 2066","Fenster","Stück","2005-12-01","2099-12-31"]
["GGL UK04 206621","Fenster","Stück","2005-12-01","2099-12-31"]
["GGL UK04 206630","Fenster","Stück","2005-12-01","2099-12-31"]
["GGL UK04 206640D","Fenster","Stück","2005-12-01","2099-12-31"]
["GGL UK04 2067","Fenster","Stück","2005-12-01","2099-12-31"]
["GGL UK04 206721","Fenster","Stück","2005-12-01","2099-12-31"]
["GGL UK04 206730","Fenster","Stück","2005-12-01","2099-12-31"]
["GGL UK04 2068","Fenster","Stück","2005-12-01","2099-12-31"]
["GGL UK04 206821","Fenster","Stück","2005-12-01","2099-12-31"]
["GGL UK04 206830","Fenster","Stück","2005-12-01","2099-12-31"]
["GGL UK04 2069","Fenster","Stück","2005-12-01","2099-12-31"]
["GGL UK04 206921","Fenster","Stück","2005-12-01","2099-12-31"]
["GGL UK04 206930","Fenster","Stück","2005-12-01","2099-12-31"]
["GGL UK04 2070","Fenster","Stück","2005-12-01","2099-12-31"]
["GGL UK04 207021","Fenster","Stück","2005-12-01","2099-12-31"]
["GGL UK04 207030","Fenster","Stück","2005-12-01","2099-12-31"]
["GGL UK04 207040D","Fenster","Stück","2005-12-01","2099-12-31"]
["GGL UK04 2070Q","Fenster","Stück","2005-12-01","2099-12-31"]
["GGL UK04 2084","Fenster","Stück","2005-12-01","2099-12-31"]
["GGL UK04 208421","Fenster","Stück","2005-12-01","2099-12-31"]
["GGL UK04 208430","Fenster","Stück","2005-12-01","2099-12-31"]
["GGL UK04 2184","Fenster","Stück","2005-12-01","2099-12-31"]
["GGL UK04 218421","Fenster","Stück","2005-12-01","2099-12-31"]
["GGL UK04 218430","Fenster","Stück","2005-12-01","2099-12-31"]
["GGL UK04 2384","Fenster","Stück","2005-12-01","2099-12-31"]
["GGL UK04 238430","Fenster","Stück","2005-12-01","2099-12-31"]
["GGL UK04 3066","Fenster","Stück","2005-12-01","2099-12-31"]
["GGL UK04 306621","Fenster","Stück","2005-12-01","2099-12-31"]
["GGL UK04 306630","Fenster","Stück","2005-12-01","2099-12-31"]
["GGL UK04 306640D","Fenster","Stück","2005-12-01","2099-12-31"]
["GGL UK04 3067","Fenster","Stück","2005-12-01","2099-12-31"]
["GGL UK04 306721","Fenster","Stück","2005-12-01","2099-12-31"]
["GGL UK04 306730","Fenster","Stück","2005-12-01","2099-12-31"]
["GGL UK04 3068","Fenster","Stück","2005-12-01","2099-12-31"]
["GGL UK04 306821","Fenster","Stück","2005-12-01","2099-12-31"]
["GGL UK04 306830","Fenster","Stück","2005-12-01","2099-12-31"]
["GGL UK04 3069","Fenster","Stück","2005-12-01","2099-12-31"]
["GGL UK04 306921","Fenster","Stück","2005-12-01","2099-12-31"]
["GGL UK04 306930","Fenster","Stück","2005-12-01","2099-12-31"]
["GGL UK04 3070","Fenster","Stück","2005-12-01","2099-12-31"]
["GGL UK04 307021","Fenster","Stück","2005-12-01","2099-12-31"]
["GGL UK04 307030","Fenster","Stück","2005-12-01","2099-12-31"]
["GGL UK04 307040D","Fenster","Stück","2005-12-01","2099-12-31"]
["GGL UK04 3070Q","Fenster","Stück","2005-12-01","2099-12-31"]
["GGL UK04 3084","Fenster","Stück","2005-12-01","2099-12-31"]
["GGL UK04 308421","Fenster","Stück","2005-12-01","2099-12-31"]
["GGL UK04 308430","Fenster","Stück","2005-12-01","2099-12-31"]
["GGL UK04 3184","Fenster","Stück","2005-12-01","2099-12-31"]
["GGL UK04 318421","Fenster","Stück","2005-12-01","2099-12-31"]
["GGL UK04 318430","Fenster","Stück","2005-12-01","2099-12-31"]
["GGL UK04 338430","Fenster","Stück","2005-12-01","2099-12-31"]
["GGL UK08 2066","Fenster","Stück","2005-12-01","2099-12-31"]
["GGL UK08 206621","Fenster","Stück","2005-12-01","2099-12-31"]
["GGL UK08 206630","Fenster","Stück","2005-12-01","2099-12-31"]
["GGL UK08 206640D","Fenster","Stück","2005-12-01","2099-12-31"]
["GGL UK08 2067","Fenster","Stück","2005-12-01","2099-12-31"]
["GGL UK08 206721","Fenster","Stück","2005-12-01","2099-12-31"]
["GGL UK08 206730","Fenster","Stück","2005-12-01","2099-12-31"]
["GGL UK08 2068","Fenster","Stück","2005-12-01","2099-12-31"]
["GGL UK08 206821","Fenster","Stück","2005-12-01","2099-12-31"]
["GGL UK08 206830","Fenster","Stück","2005-12-01","2099-12-31"]
["GGL UK08 2069","Fenster","Stück","2005-12-01","2099-12-31"]
["GGL UK08 206921","Fenster","Stück","2005-12-01","2099-12-31"]
["GGL UK08 206930","Fenster","Stück","2005-12-01","2099-12-31"]
["GGL UK08 2070","Fenster","Stück","2005-12-01","2099-12-31"]
["GGL UK08 207021","Fenster","Stück","2005-12-01","2099-12-31"]
["GGL UK08 207030","Fenster","Stück","2005-12-01","2099-12-31"]
["GGL UK08 207040D","Fenster","Stück","2005-12-01","2099-12-31"]
["GGL UK08 2070Q","Fenster","Stück","2005-12-01","2099-12-31"]
["GGL UK08 2084","Fenster","Stück","2005-12-01","2099-12-31"]
["GGL UK08 208421","Fenster","Stück","2005-12-01","2099-12-31"]
["GGL UK08 208430","Fenster","Stück","2005-12-01","2099-12-31"]
["GGL UK08 2184","Fenster","Stück","2005-12-01","2099-12-31"]
["GGL UK08 218421","Fenster","Stück","2005-12-01","2099-12-31"]
["GGL UK08 218430","Fenster","Stück","2005-12-01","2099-12-31"]
["GGL UK08 2384","Fenster","Stück","2005-12-01","2099-12-31"]
["GGL UK08 238430","Fenster","Stück","2005-12-01","2099-12-31"]
["GGL UK08 3066","Fenster","Stück","2005-12-01","2099-12-31"]
["GGL UK08 306621","Fenster","Stück","2005-12-01","2099-12-31"]
["GGL UK08 306630","Fenster","Stück","2005-12-01","2099-12-31"]
["GGL UK08 306640D","Fenster","Stück","2005-12-01","2099-12-31"]
["GGL UK08 3067","Fenster","Stück","2005-12-01","2099-12-31"]
["GGL UK08 306721","Fenster","Stück","2005-12-01","2099-12-31"]
["GGL UK08 306730","Fenster","Stück","2005-12-01","2099-12-31"]
["GGL UK08 3068","Fenster","Stück","2005-12-01","2099-12-31"]
["GGL UK08 306821","Fenster","Stück","2005-12-01","2099-12-31"]
["GGL UK08 306830","Fenster","Stück","2005-12-01","2099-12-31"]
["GGL UK08 3069","Fenster","Stück","2005-12-01","2099-12-31"]
["GGL UK08 306921","Fenster","Stück","2005-12-01","2099-12-31"]
["GGL UK08 306930","Fenster","Stück","2005-12-01","2099-12-31"]
["GGL UK08 3070","Fenster","Stück","2005-12-01","2099-12-31"]
["GGL UK08 307021","Fenster","Stück","2005-12-01","2099-12-31"]
["GGL UK08 307030","Fenster","Stück","2005-12-01","2099-12-31"]
["GGL UK08 307040D","Fenster","Stück","2005-12-01","2099-12-31"]
["GGL UK08 3070Q","Fenster","Stück","2005-12-01","2099-12-31"]
["GGL UK08 3084","Fenster","Stück","2005-12-01","2099-12-31"]
["GGL UK08 308421","Fenster","Stück","2005-12-01","2099-12-31"]
["GGL UK08 308430","Fenster","Stück","2005-12-01","2099-12-31"]
["GGL UK08 3184","Fenster","Stück","2005-12-01","2099-12-31"]
["GGL UK08 318421","Fenster","Stück","2005-12-01","2099-12-31"]
["GGL UK08 318430","Fenster","Stück","2005-12-01","2099-12-31"]
["GGL UK08 3384","Fenster","Stück","2005-12-01","2099-12-31"]
["GGL UK10 2066","Fenster","Stück","2005-12-01","2099-12-31"]
["GGL UK10 206621","Fenster","Stück","2005-12-01","2099-12-31"]
["GGL UK10 2067","Fenster","Stück","2005-12-01","2099-12-31"]
["GGL UK10 206721","Fenster","Stück","2005-12-01","2099-12-31"]
["GGL UK10 2068","Fenster","Stück","2005-12-01","2099-12-31"]
["GGL UK10 206821","Fenster","Stück","2005-12-01","2099-12-31"]
["GGL UK10 2069","Fenster","Stück","2005-12-01","2099-12-31"]
["GGL UK10 206921","Fenster","Stück","2005-12-01","2099-12-31"]
["GGL UK10 2070","Fenster","Stück","2005-12-01","2099-12-31"]
["GGL UK10 207021","Fenster","Stück","2005-12-01","2099-12-31"]
["GGL UK10 207030","Fenster","Stück","2005-12-01","2099-12-31"]
["GGL UK10 2070Q","Fenster","Stück","2005-12-01","2099-12-31"]
["GGL UK10 2084","Fenster","Stück","2005-12-01","2099-12-31"]
["GGL UK10 208421","Fenster","Stück","2005-12-01","2099-12-31"]
["GGL UK10 208430","Fenster","Stück","2005-12-01","2099-12-31"]
["GGL UK10 2184","Fenster","Stück","2005-12-01","2099-12-31"]
["GGL UK10 218421","Fenster","Stück","2005-12-01","2099-12-31"]
["GGL UK10 2384","Fenster","Stück","2005-12-01","2099-12-31"]
["GGL UK10 3066","Fenster","Stück","2005-12-01","2099-12-31"]
["GGL UK10 306621","Fenster","Stück","2005-12-01","2099-12-31"]
["GGL UK10 3067","Fenster","Stück","2005-12-01","2099-12-31"]
["GGL UK10 306721","Fenster","Stück","2005-12-01","2099-12-31"]
["GGL UK10 3068","Fenster","Stück","2005-12-01","2099-12-31"]
["GGL UK10 306821","Fenster","Stück","2005-12-01","2099-12-31"]
["GGL UK10 3069","Fenster","Stück","2005-12-01","2099-12-31"]
["GGL UK10 306921","Fenster","Stück","2005-12-01","2099-12-31"]
["GGL UK10 3070","Fenster","Stück","2005-12-01","2099-12-31"]
["GGL UK10 307021","Fenster","Stück","2005-12-01","2099-12-31"]
["GGL UK10 307030","Fenster","Stück","2005-12-01","2099-12-31"]
["GGL UK10 3070Q","Fenster","Stück","2005-12-01","2099-12-31"]
["GGL UK10 3084","Fenster","Stück","2005-12-01","2099-12-31"]
["GGL UK10 308421","Fenster","Stück","2005-12-01","2099-12-31"]
["GGL UK10 308430","Fenster","Stück","2005-12-01","2099-12-31"]
["GGL UK10 3184","Fenster","Stück","2005-12-01","2099-12-31"]
["GGL UK10 318421","Fenster","Stück","2005-12-01","2099-12-31"]
["GGLS FFKF06 2066","Fenster","Stück","2005-12-01","2099-12-31"]
["GGLS FFKF06 206630","Fenster","Stück","2005-12-01","2099-12-31"]
["GGLS FFKF06 2070","Fenster","Stück","2005-12-01","2099-12-31"]
["GGLS FFKF06 207030","Fenster","Stück","2005-12-01","2099-12-31"]
["GGLS FFKF06 216630","Fenster","Stück","2005-12-01","2099-12-31"]
["GGLS FFKF06 2170","Fenster","Stück","2005-12-01","2099-12-31"]
["GGLS FFKF06 217030","Fenster","Stück","2005-12-01","2099-12-31"]
["GGLS FFKF08 2066","Fenster","Stück","2005-12-01","2099-12-31"]
["GGLS FFKF08 206630","Fenster","Stück","2005-12-01","2099-12-31"]
["GGLS FFKF08 2070","Fenster","Stück","2005-12-01","2099-12-31"]
["GGLS FFKF08 207030","Fenster","Stück","2005-12-01","2099-12-31"]
["GGLS FFKF08 2166","Fenster","Stück","2005-12-01","2099-12-31"]
["GGLS FFKF08 216630","Fenster","Stück","2005-12-01","2099-12-31"]
["GGLS FFKF08 217030","Fenster","Stück","2005-12-01","2099-12-31"]
["GGU CK02 0062","Fenster","Stück","2005-12-01","2099-12-31"]
["GGU CK02 006221","Fenster","Stück","2005-12-01","2099-12-31"]
["GGU CK02 0066","Fenster","Stück","2005-12-01","2099-12-31"]
["GGU CK02 006621","Fenster","Stück","2005-12-01","2099-12-31"]
["GGU CK02 006630","Fenster","Stück","2005-12-01","2099-12-31"]
["GGU CK02 0067","Fenster","Stück","2005-12-01","2099-12-31"]
["GGU CK02 006721","Fenster","Stück","2005-12-01","2099-12-31"]
["GGU CK02 006730","Fenster","Stück","2005-12-01","2099-12-31"]
["GGU CK02 0068","Fenster","Stück","2005-12-01","2099-12-31"]
["GGU CK02 006821","Fenster","Stück","2005-12-01","2099-12-31"]
["GGU CK02 006830","Fenster","Stück","2005-12-01","2099-12-31"]
["GGU CK02 0069","Fenster","Stück","2005-12-01","2099-12-31"]
["GGU CK02 006921","Fenster","Stück","2005-12-01","2099-12-31"]
["GGU CK02 006930","Fenster","Stück","2005-12-01","2099-12-31"]
["GGU CK02 0070","Fenster","Stück","2005-12-01","2099-12-31"]
["GGU CK02 007021","Fenster","Stück","2005-12-01","2099-12-31"]
["GGU CK02 007030","Fenster","Stück","2005-12-01","2099-12-31"]
["GGU CK02 0070Q","Fenster","Stück","2005-12-01","2099-12-31"]
["GGU CK02 0084","Fenster","Stück","2005-12-01","2099-12-31"]
["GGU CK02 008421","Fenster","Stück","2005-12-01","2099-12-31"]
["GGU CK02 008430","Fenster","Stück","2005-12-01","2099-12-31"]
["GGU CK02 0184","Fenster","Stück","2005-12-01","2099-12-31"]
["GGU CK02 018421","Fenster","Stück","2005-12-01","2099-12-31"]
["GGU CK02 018430","Fenster","Stück","2005-12-01","2099-12-31"]
["GGU CK02 0384","Fenster","Stück","2005-12-01","2099-12-31"]
["GGU CK02 038421","Fenster","Stück","2005-12-01","2099-12-31"]
["GGU CK02 038430","Fenster","Stück","2005-12-01","2099-12-31"]
["GGU CK04 0062","Fenster","Stück","2005-12-01","2099-12-31"]
["GGU CK04 006221","Fenster","Stück","2005-12-01","2099-12-31"]
["GGU CK04 0066","Fenster","Stück","2005-12-01","2099-12-31"]
["GGU CK04 006621","Fenster","Stück","2005-12-01","2099-12-31"]
["GGU CK04 006630","Fenster","Stück","2005-12-01","2099-12-31"]
["GGU CK04 0067","Fenster","Stück","2005-12-01","2099-12-31"]
["GGU CK04 006721","Fenster","Stück","2005-12-01","2099-12-31"]
["GGU CK04 006730","Fenster","Stück","2005-12-01","2099-12-31"]
["GGU CK04 0068","Fenster","Stück","2005-12-01","2099-12-31"]
["GGU CK04 006821","Fenster","Stück","2005-12-01","2099-12-31"]
["GGU CK04 006830","Fenster","Stück","2005-12-01","2099-12-31"]
["GGU CK04 0069","Fenster","Stück","2005-12-01","2099-12-31"]
["GGU CK04 006921","Fenster","Stück","2005-12-01","2099-12-31"]
["GGU CK04 006930","Fenster","Stück","2005-12-01","2099-12-31"]
["GGU CK04 0070","Fenster","Stück","2005-12-01","2099-12-31"]
["GGU CK04 007021","Fenster","Stück","2005-12-01","2099-12-31"]
["GGU CK04 007030","Fenster","Stück","2005-12-01","2099-12-31"]
["GGU CK04 0070Q","Fenster","Stück","2005-12-01","2099-12-31"]
["GGU CK04 0084","Fenster","Stück","2005-12-01","2099-12-31"]
["GGU CK04 008421","Fenster","Stück","2005-12-01","2099-12-31"]
["GGU CK04 008430","Fenster","Stück","2005-12-01","2099-12-31"]
["GGU CK04 0184","Fenster","Stück","2005-12-01","2099-12-31"]
["GGU CK04 018421","Fenster","Stück","2005-12-01","2099-12-31"]
["GGU CK04 018430","Fenster","Stück","2005-12-01","2099-12-31"]
["GGU CK04 0384","Fenster","Stück","2005-12-01","2099-12-31"]
["GGU CK04 038421","Fenster","Stück","2005-12-01","2099-12-31"]
["GGU CK04 038430","Fenster","Stück","2005-12-01","2099-12-31"]
["GGU CK06 0062","Fenster","Stück","2005-12-01","2099-12-31"]
["GGU CK06 006221","Fenster","Stück","2005-12-01","2099-12-31"]
["GGU CK06 0066","Fenster","Stück","2005-12-01","2099-12-31"]
["GGU CK06 006621","Fenster","Stück","2005-12-01","2099-12-31"]
["GGU CK06 006630","Fenster","Stück","2005-12-01","2099-12-31"]
["GGU CK06 0067","Fenster","Stück","2005-12-01","2099-12-31"]
["GGU CK06 006721","Fenster","Stück","2005-12-01","2099-12-31"]
["GGU CK06 006730","Fenster","Stück","2005-12-01","2099-12-31"]
["GGU CK06 0068","Fenster","Stück","2005-12-01","2099-12-31"]
["GGU CK06 006821","Fenster","Stück","2005-12-01","2099-12-31"]
["GGU CK06 006830","Fenster","Stück","2005-12-01","2099-12-31"]
["GGU CK06 0069","Fenster","Stück","2005-12-01","2099-12-31"]
["GGU CK06 006921","Fenster","Stück","2005-12-01","2099-12-31"]
["GGU CK06 006930","Fenster","Stück","2005-12-01","2099-12-31"]
["GGU CK06 0070","Fenster","Stück","2005-12-01","2099-12-31"]
["GGU CK06 007021","Fenster","Stück","2005-12-01","2099-12-31"]
["GGU CK06 007030","Fenster","Stück","2005-12-01","2099-12-31"]
["GGU CK06 0084","Fenster","Stück","2005-12-01","2099-12-31"]
["GGU CK06 008421","Fenster","Stück","2005-12-01","2099-12-31"]
["GGU CK06 008430","Fenster","Stück","2005-12-01","2099-12-31"]
["GGU CK06 0184","Fenster","Stück","2005-12-01","2099-12-31"]
["GGU CK06 018421","Fenster","Stück","2005-12-01","2099-12-31"]
["GGU CK06 018430","Fenster","Stück","2005-12-01","2099-12-31"]
["GGU CK06 0384","Fenster","Stück","2005-12-01","2099-12-31"]
["GGU CK06 038421","Fenster","Stück","2005-12-01","2099-12-31"]
["GGU CK06 038430","Fenster","Stück","2005-12-01","2099-12-31"]
["GGU FK04 0062","Fenster","Stück","2005-12-01","2099-12-31"]
["GGU FK04 006221","Fenster","Stück","2005-12-01","2099-12-31"]
["GGU FK04 0062D","Fenster","Stück","2005-12-01","2099-12-31"]
["GGU FK04 0062D21A","Fenster","Stück","2005-12-01","2099-12-31"]
["GGU FK04 0066","Fenster","Stück","2005-12-01","2099-12-31"]
["GGU FK04 006621","Fenster","Stück","2005-12-01","2099-12-31"]
["GGU FK04 0067","Fenster","Stück","2005-12-01","2099-12-31"]
["GGU FK04 006721","Fenster","Stück","2005-12-01","2099-12-31"]
["GGU FK04 0068","Fenster","Stück","2005-12-01","2099-12-31"]
["GGU FK04 006821","Fenster","Stück","2005-12-01","2099-12-31"]
["GGU FK04 0069","Fenster","Stück","2005-12-01","2099-12-31"]
["GGU FK04 006921","Fenster","Stück","2005-12-01","2099-12-31"]
["GGU FK04 0070","Fenster","Stück","2005-12-01","2099-12-31"]
["GGU FK04 007021","Fenster","Stück","2005-12-01","2099-12-31"]
["GGU FK04 007030","Fenster","Stück","2005-12-01","2099-12-31"]
["GGU FK04 0084","Fenster","Stück","2005-12-01","2099-12-31"]
["GGU FK04 008421","Fenster","Stück","2005-12-01","2099-12-31"]
["GGU FK04 008430","Fenster","Stück","2005-12-01","2099-12-31"]
["GGU FK04 0184","Fenster","Stück","2005-12-01","2099-12-31"]
["GGU FK04 018421","Fenster","Stück","2005-12-01","2099-12-31"]
["GGU FK04 0384","Fenster","Stück","2005-12-01","2099-12-31"]
["GGU FK06 0062","Fenster","Stück","2005-12-01","2099-12-31"]
["GGU FK06 006221","Fenster","Stück","2005-12-01","2099-12-31"]
["GGU FK06 0062D","Fenster","Stück","2005-12-01","2099-12-31"]
["GGU FK06 0062D21A","Fenster","Stück","2005-12-01","2099-12-31"]
["GGU FK06 0066","Fenster","Stück","2005-12-01","2099-12-31"]
["GGU FK06 006621","Fenster","Stück","2005-12-01","2099-12-31"]
["GGU FK06 006630","Fenster","Stück","2005-12-01","2099-12-31"]
["GGU FK06 0067","Fenster","Stück","2005-12-01","2099-12-31"]
["GGU FK06 006721","Fenster","Stück","2005-12-01","2099-12-31"]
["GGU FK06 006730","Fenster","Stück","2005-12-01","2099-12-31"]
["GGU FK06 0068","Fenster","Stück","2005-12-01","2099-12-31"]
["GGU FK06 006821","Fenster","Stück","2005-12-01","2099-12-31"]
["GGU FK06 006830","Fenster","Stück","2005-12-01","2099-12-31"]
["GGU FK06 0069","Fenster","Stück","2005-12-01","2099-12-31"]
["GGU FK06 006921","Fenster","Stück","2005-12-01","2099-12-31"]
["GGU FK06 006930","Fenster","Stück","2005-12-01","2099-12-31"]
["GGU FK06 0070","Fenster","Stück","2005-12-01","2099-12-31"]
["GGU FK06 007021","Fenster","Stück","2005-12-01","2099-12-31"]
["GGU FK06 007030","Fenster","Stück","2005-12-01","2099-12-31"]
["GGU FK06 0070Q","Fenster","Stück","2005-12-01","2099-12-31"]
["GGU FK06 0084","Fenster","Stück","2005-12-01","2099-12-31"]
["GGU FK06 008421","Fenster","Stück","2005-12-01","2099-12-31"]
["GGU FK06 008430","Fenster","Stück","2005-12-01","2099-12-31"]
["GGU FK06 0184","Fenster","Stück","2005-12-01","2099-12-31"]
["GGU FK06 018421","Fenster","Stück","2005-12-01","2099-12-31"]
["GGU FK06 018430","Fenster","Stück","2005-12-01","2099-12-31"]
["GGU FK06 0384","Fenster","Stück","2005-12-01","2099-12-31"]
["GGU FK06 038421","Fenster","Stück","2005-12-01","2099-12-31"]
["GGU FK06 038430","Fenster","Stück","2005-12-01","2099-12-31"]
["GGU FK08 0062","Fenster","Stück","2005-12-01","2099-12-31"]
["GGU FK08 006221","Fenster","Stück","2005-12-01","2099-12-31"]
["GGU FK08 0062D","Fenster","Stück","2005-12-01","2099-12-31"]
["GGU FK08 0062D21A","Fenster","Stück","2005-12-01","2099-12-31"]
["GGU FK08 0066","Fenster","Stück","2005-12-01","2099-12-31"]
["GGU FK08 006621","Fenster","Stück","2005-12-01","2099-12-31"]
["GGU FK08 006630","Fenster","Stück","2005-12-01","2099-12-31"]
["GGU FK08 0067","Fenster","Stück","2005-12-01","2099-12-31"]
["GGU FK08 006721","Fenster","Stück","2005-12-01","2099-12-31"]
["GGU FK08 006730","Fenster","Stück","2005-12-01","2099-12-31"]
["GGU FK08 0068","Fenster","Stück","2005-12-01","2099-12-31"]
["GGU FK08 006821","Fenster","Stück","2005-12-01","2099-12-31"]
["GGU FK08 006830","Fenster","Stück","2005-12-01","2099-12-31"]
["GGU FK08 0069","Fenster","Stück","2005-12-01","2099-12-31"]
["GGU FK08 006921","Fenster","Stück","2005-12-01","2099-12-31"]
["GGU FK08 006930","Fenster","Stück","2005-12-01","2099-12-31"]
["GGU FK08 0070","Fenster","Stück","2005-12-01","2099-12-31"]
["GGU FK08 007021","Fenster","Stück","2005-12-01","2099-12-31"]
["GGU FK08 007030","Fenster","Stück","2005-12-01","2099-12-31"]
["GGU FK08 0084","Fenster","Stück","2005-12-01","2099-12-31"]
["GGU FK08 008421","Fenster","Stück","2005-12-01","2099-12-31"]
["GGU FK08 008430","Fenster","Stück","2005-12-01","2099-12-31"]
["GGU FK08 0184","Fenster","Stück","2005-12-01","2099-12-31"]
["GGU FK08 018421","Fenster","Stück","2005-12-01","2099-12-31"]
["GGU FK08 018430","Fenster","Stück","2005-12-01","2099-12-31"]
["GGU FK08 0384","Fenster","Stück","2005-12-01","2099-12-31"]
["GGU FK08 038421","Fenster","Stück","2005-12-01","2099-12-31"]
["GGU FK08 038430","Fenster","Stück","2005-12-01","2099-12-31"]
["GGU MK04 0062","Fenster","Stück","2005-12-01","2099-12-31"]
["GGU MK04 006221","Fenster","Stück","2005-12-01","2099-12-31"]
["GGU MK04 0062D","Fenster","Stück","2005-12-01","2099-12-31"]
["GGU MK04 0062D21A","Fenster","Stück","2005-12-01","2099-12-31"]
["GGU MK04 0066","Fenster","Stück","2005-12-01","2099-12-31"]
["GGU MK04 006621","Fenster","Stück","2005-12-01","2099-12-31"]
["GGU MK04 006630","Fenster","Stück","2005-12-01","2099-12-31"]
["GGU MK04 006640D","Fenster","Stück","2005-12-01","2099-12-31"]
["GGU MK04 0067","Fenster","Stück","2005-12-01","2099-12-31"]
["GGU MK04 006721","Fenster","Stück","2005-12-01","2099-12-31"]
["GGU MK04 006730","Fenster","Stück","2005-12-01","2099-12-31"]
["GGU MK04 0068","Fenster","Stück","2005-12-01","2099-12-31"]
["GGU MK04 006821","Fenster","Stück","2005-12-01","2099-12-31"]
["GGU MK04 006830","Fenster","Stück","2005-12-01","2099-12-31"]
["GGU MK04 0069","Fenster","Stück","2005-12-01","2099-12-31"]
["GGU MK04 006921","Fenster","Stück","2005-12-01","2099-12-31"]
["GGU MK04 006930","Fenster","Stück","2005-12-01","2099-12-31"]
["GGU MK04 0070","Fenster","Stück","2005-12-01","2099-12-31"]
["GGU MK04 007021","Fenster","Stück","2005-12-01","2099-12-31"]
["GGU MK04 007030","Fenster","Stück","2005-12-01","2099-12-31"]
["GGU MK04 007040D","Fenster","Stück","2005-12-01","2099-12-31"]
["GGU MK04 0070Q","Fenster","Stück","2005-12-01","2099-12-31"]
["GGU MK04 008230","Fenster","Stück","2005-12-01","2099-12-31"]
["GGU MK04 0084","Fenster","Stück","2005-12-01","2099-12-31"]
["GGU MK04 008421","Fenster","Stück","2005-12-01","2099-12-31"]
["GGU MK04 008430","Fenster","Stück","2005-12-01","2099-12-31"]
["GGU MK04 0184","Fenster","Stück","2005-12-01","2099-12-31"]
["GGU MK04 018421","Fenster","Stück","2005-12-01","2099-12-31"]
["GGU MK04 018430","Fenster","Stück","2005-12-01","2099-12-31"]
["GGU MK04 0384","Fenster","Stück","2005-12-01","2099-12-31"]
["GGU MK04 038421","Fenster","Stück","2005-12-01","2099-12-31"]
["GGU MK04 038430","Fenster","Stück","2005-12-01","2099-12-31"]
["GGU MK06 0062","Fenster","Stück","2005-12-01","2099-12-31"]
["GGU MK06 006221","Fenster","Stück","2005-12-01","2099-12-31"]
["GGU MK06 0062D","Fenster","Stück","2005-12-01","2099-12-31"]
["GGU MK06 0062D21A","Fenster","Stück","2005-12-01","2099-12-31"]
["GGU MK06 0066","Fenster","Stück","2005-12-01","2099-12-31"]
["GGU MK06 006621","Fenster","Stück","2005-12-01","2099-12-31"]
["GGU MK06 006630","Fenster","Stück","2005-12-01","2099-12-31"]
["GGU MK06 006640D","Fenster","Stück","2005-12-01","2099-12-31"]
["GGU MK06 0067","Fenster","Stück","2005-12-01","2099-12-31"]
["GGU MK06 006721","Fenster","Stück","2005-12-01","2099-12-31"]
["GGU MK06 006730","Fenster","Stück","2005-12-01","2099-12-31"]
["GGU MK06 0068","Fenster","Stück","2005-12-01","2099-12-31"]
["GGU MK06 006821","Fenster","Stück","2005-12-01","2099-12-31"]
["GGU MK06 006830","Fenster","Stück","2005-12-01","2099-12-31"]
["GGU MK06 0069","Fenster","Stück","2005-12-01","2099-12-31"]
["GGU MK06 006921","Fenster","Stück","2005-12-01","2099-12-31"]
["GGU MK06 006930","Fenster","Stück","2005-12-01","2099-12-31"]
["GGU MK06 0070","Fenster","Stück","2005-12-01","2099-12-31"]
["GGU MK06 007021","Fenster","Stück","2005-12-01","2099-12-31"]
["GGU MK06 007030","Fenster","Stück","2005-12-01","2099-12-31"]
["GGU MK06 007040D","Fenster","Stück","2005-12-01","2099-12-31"]
["GGU MK06 0070Q","Fenster","Stück","2005-12-01","2099-12-31"]
["GGU MK06 008230","Fenster","Stück","2005-12-01","2099-12-31"]
["GGU MK06 0084","Fenster","Stück","2005-12-01","2099-12-31"]
["GGU MK06 008421","Fenster","Stück","2005-12-01","2099-12-31"]
["GGU MK06 008430","Fenster","Stück","2005-12-01","2099-12-31"]
["GGU MK06 0184","Fenster","Stück","2005-12-01","2099-12-31"]
["GGU MK06 018421","Fenster","Stück","2005-12-01","2099-12-31"]
["GGU MK06 018430","Fenster","Stück","2005-12-01","2099-12-31"]
["GGU MK06 0384","Fenster","Stück","2005-12-01","2099-12-31"]
["GGU MK06 038421","Fenster","Stück","2005-12-01","2099-12-31"]
["GGU MK06 038430","Fenster","Stück","2005-12-01","2099-12-31"]
["GGU MK08 0062","Fenster","Stück","2005-12-01","2099-12-31"]
["GGU MK08 006221","Fenster","Stück","2005-12-01","2099-12-31"]
["GGU MK08 0062D","Fenster","Stück","2005-12-01","2099-12-31"]
["GGU MK08 0062D21A","Fenster","Stück","2005-12-01","2099-12-31"]
["GGU MK08 0066","Fenster","Stück","2005-12-01","2099-12-31"]
["GGU MK08 006621","Fenster","Stück","2005-12-01","2099-12-31"]
["GGU MK08 006630","Fenster","Stück","2005-12-01","2099-12-31"]
["GGU MK08 006640D","Fenster","Stück","2005-12-01","2099-12-31"]
["GGU MK08 0067","Fenster","Stück","2005-12-01","2099-12-31"]
["GGU MK08 006721","Fenster","Stück","2005-12-01","2099-12-31"]
["GGU MK08 006730","Fenster","Stück","2005-12-01","2099-12-31"]
["GGU MK08 0068","Fenster","Stück","2005-12-01","2099-12-31"]
["GGU MK08 006821","Fenster","Stück","2005-12-01","2099-12-31"]
["GGU MK08 006830","Fenster","Stück","2005-12-01","2099-12-31"]
["GGU MK08 0069","Fenster","Stück","2005-12-01","2099-12-31"]
["GGU MK08 006921","Fenster","Stück","2005-12-01","2099-12-31"]
["GGU MK08 006930","Fenster","Stück","2005-12-01","2099-12-31"]
["GGU MK08 0070","Fenster","Stück","2005-12-01","2099-12-31"]
["GGU MK08 007021","Fenster","Stück","2005-12-01","2099-12-31"]
["GGU MK08 007030","Fenster","Stück","2005-12-01","2099-12-31"]
["GGU MK08 007040D","Fenster","Stück","2005-12-01","2099-12-31"]
["GGU MK08 0070Q","Fenster","Stück","2005-12-01","2099-12-31"]
["GGU MK08 008230","Fenster","Stück","2005-12-01","2099-12-31"]
["GGU MK08 0084","Fenster","Stück","2005-12-01","2099-12-31"]
["GGU MK08 008421","Fenster","Stück","2005-12-01","2099-12-31"]
["GGU MK08 008430","Fenster","Stück","2005-12-01","2099-12-31"]
["GGU MK08 0184","Fenster","Stück","2005-12-01","2099-12-31"]
["GGU MK08 018421","Fenster","Stück","2005-12-01","2099-12-31"]
["GGU MK08 018430","Fenster","Stück","2005-12-01","2099-12-31"]
["GGU MK08 0384","Fenster","Stück","2005-12-01","2099-12-31"]
["GGU MK08 038421","Fenster","Stück","2005-12-01","2099-12-31"]
["GGU MK08 038430","Fenster","Stück","2005-12-01","2099-12-31"]
["GGU MK10 0062","Fenster","Stück","2005-12-01","2099-12-31"]
["GGU MK10 006221","Fenster","Stück","2005-12-01","2099-12-31"]
["GGU MK10 0066","Fenster","Stück","2005-12-01","2099-12-31"]
["GGU MK10 006621","Fenster","Stück","2005-12-01","2099-12-31"]
["GGU MK10 006630","Fenster","Stück","2005-12-01","2099-12-31"]
["GGU MK10 0067","Fenster","Stück","2005-12-01","2099-12-31"]
["GGU MK10 006721","Fenster","Stück","2005-12-01","2099-12-31"]
["GGU MK10 0068","Fenster","Stück","2005-12-01","2099-12-31"]
["GGU MK10 006821","Fenster","Stück","2005-12-01","2099-12-31"]
["GGU MK10 0069","Fenster","Stück","2005-12-01","2099-12-31"]
["GGU MK10 006921","Fenster","Stück","2005-12-01","2099-12-31"]
["GGU MK10 0070","Fenster","Stück","2005-12-01","2099-12-31"]
["GGU MK10 007021","Fenster","Stück","2005-12-01","2099-12-31"]
["GGU MK10 007030","Fenster","Stück","2005-12-01","2099-12-31"]
["GGU MK10 0070Q","Fenster","Stück","2005-12-01","2099-12-31"]
["GGU MK10 0084","Fenster","Stück","2005-12-01","2099-12-31"]
["GGU MK10 008421","Fenster","Stück","2005-12-01","2099-12-31"]
["GGU MK10 008430","Fenster","Stück","2005-12-01","2099-12-31"]
["GGU MK10 0184","Fenster","Stück","2005-12-01","2099-12-31"]
["GGU MK10 018421","Fenster","Stück","2005-12-01","2099-12-31"]
["GGU MK10 018430","Fenster","Stück","2005-12-01","2099-12-31"]
["GGU MK10 0384","Fenster","Stück","2005-12-01","2099-12-31"]
["GGU MK10 038421","Fenster","Stück","2005-12-01","2099-12-31"]
["GGU MK10 038430","Fenster","Stück","2005-12-01","2099-12-31"]
["GGU PK06 0062","Fenster","Stück","2005-12-01","2099-12-31"]
["GGU PK06 006221","Fenster","Stück","2005-12-01","2099-12-31"]
["GGU PK06 0066","Fenster","Stück","2005-12-01","2099-12-31"]
["GGU PK06 006621","Fenster","Stück","2005-12-01","2099-12-31"]
["GGU PK06 006630","Fenster","Stück","2005-12-01","2099-12-31"]
["GGU PK06 006640D","Fenster","Stück","2005-12-01","2099-12-31"]
["GGU PK06 0067","Fenster","Stück","2005-12-01","2099-12-31"]
["GGU PK06 006721","Fenster","Stück","2005-12-01","2099-12-31"]
["GGU PK06 006730","Fenster","Stück","2005-12-01","2099-12-31"]
["GGU PK06 0068","Fenster","Stück","2005-12-01","2099-12-31"]
["GGU PK06 006821","Fenster","Stück","2005-12-01","2099-12-31"]
["GGU PK06 006830","Fenster","Stück","2005-12-01","2099-12-31"]
["GGU PK06 0069","Fenster","Stück","2005-12-01","2099-12-31"]
["GGU PK06 006921","Fenster","Stück","2005-12-01","2099-12-31"]
["GGU PK06 006930","Fenster","Stück","2005-12-01","2099-12-31"]
["GGU PK06 0070","Fenster","Stück","2005-12-01","2099-12-31"]
["GGU PK06 007021","Fenster","Stück","2005-12-01","2099-12-31"]
["GGU PK06 007030","Fenster","Stück","2005-12-01","2099-12-31"]
["GGU PK06 007040D","Fenster","Stück","2005-12-01","2099-12-31"]
["GGU PK06 0070Q","Fenster","Stück","2005-12-01","2099-12-31"]
["GGU PK06 0084","Fenster","Stück","2005-12-01","2099-12-31"]
["GGU PK06 008421","Fenster","Stück","2005-12-01","2099-12-31"]
["GGU PK06 008430","Fenster","Stück","2005-12-01","2099-12-31"]
["GGU PK06 0184","Fenster","Stück","2005-12-01","2099-12-31"]
["GGU PK06 018421","Fenster","Stück","2005-12-01","2099-12-31"]
["GGU PK06 0384","Fenster","Stück","2005-12-01","2099-12-31"]
["GGU PK06 SD00402","Fenster","Stück","2005-12-01","2099-12-31"]
["GGU PK06 SD00403","Fenster","Stück","2005-12-01","2099-12-31"]
["GGU PK08 0062","Fenster","Stück","2005-12-01","2099-12-31"]
["GGU PK08 006221","Fenster","Stück","2005-12-01","2099-12-31"]
["GGU PK08 0066","Fenster","Stück","2005-12-01","2099-12-31"]
["GGU PK08 006621","Fenster","Stück","2005-12-01","2099-12-31"]
["GGU PK08 006630","Fenster","Stück","2005-12-01","2099-12-31"]
["GGU PK08 006640D","Fenster","Stück","2005-12-01","2099-12-31"]
["GGU PK08 0067","Fenster","Stück","2005-12-01","2099-12-31"]
["GGU PK08 006721","Fenster","Stück","2005-12-01","2099-12-31"]
["GGU PK08 0068","Fenster","Stück","2005-12-01","2099-12-31"]
["GGU PK08 006821","Fenster","Stück","2005-12-01","2099-12-31"]
["GGU PK08 0069","Fenster","Stück","2005-12-01","2099-12-31"]
["GGU PK08 006921","Fenster","Stück","2005-12-01","2099-12-31"]
["GGU PK08 0070","Fenster","Stück","2005-12-01","2099-12-31"]
["GGU PK08 007021","Fenster","Stück","2005-12-01","2099-12-31"]
["GGU PK08 007030","Fenster","Stück","2005-12-01","2099-12-31"]
["GGU PK08 007040D","Fenster","Stück","2005-12-01","2099-12-31"]
["GGU PK08 0070Q","Fenster","Stück","2005-12-01","2099-12-31"]
["GGU PK08 0084","Fenster","Stück","2005-12-01","2099-12-31"]
["GGU PK08 008421","Fenster","Stück","2005-12-01","2099-12-31"]
["GGU PK08 008430","Fenster","Stück","2005-12-01","2099-12-31"]
["GGU PK08 0184","Fenster","Stück","2005-12-01","2099-12-31"]
["GGU PK08 018421","Fenster","Stück","2005-12-01","2099-12-31"]
["GGU PK08 0384","Fenster","Stück","2005-12-01","2099-12-31"]
["GGU PK08 SD00402","Fenster","Stück","2005-12-01","2099-12-31"]
["GGU PK08 SD00403","Fenster","Stück","2005-12-01","2099-12-31"]
["GGU PK10 0062","Fenster","Stück","2005-12-01","2099-12-31"]
["GGU PK10 006221","Fenster","Stück","2005-12-01","2099-12-31"]
["GGU PK10 0066","Fenster","Stück","2005-12-01","2099-12-31"]
["GGU PK10 006621","Fenster","Stück","2005-12-01","2099-12-31"]
["GGU PK10 006630","Fenster","Stück","2005-12-01","2099-12-31"]
["GGU PK10 0067","Fenster","Stück","2005-12-01","2099-12-31"]
["GGU PK10 006721","Fenster","Stück","2005-12-01","2099-12-31"]
["GGU PK10 006730","Fenster","Stück","2005-12-01","2099-12-31"]
["GGU PK10 0068","Fenster","Stück","2005-12-01","2099-12-31"]
["GGU PK10 006821","Fenster","Stück","2005-12-01","2099-12-31"]
["GGU PK10 006830","Fenster","Stück","2005-12-01","2099-12-31"]
["GGU PK10 0069","Fenster","Stück","2005-12-01","2099-12-31"]
["GGU PK10 006921","Fenster","Stück","2005-12-01","2099-12-31"]
["GGU PK10 006930","Fenster","Stück","2005-12-01","2099-12-31"]
["GGU PK10 0070","Fenster","Stück","2005-12-01","2099-12-31"]
["GGU PK10 007021","Fenster","Stück","2005-12-01","2099-12-31"]
["GGU PK10 007030","Fenster","Stück","2005-12-01","2099-12-31"]
["GGU PK10 0070Q","Fenster","Stück","2005-12-01","2099-12-31"]
["GGU PK10 0084","Fenster","Stück","2005-12-01","2099-12-31"]
["GGU PK10 008421","Fenster","Stück","2005-12-01","2099-12-31"]
["GGU PK10 008430","Fenster","Stück","2005-12-01","2099-12-31"]
["GGU PK10 0184","Fenster","Stück","2005-12-01","2099-12-31"]
["GGU PK10 018421","Fenster","Stück","2005-12-01","2099-12-31"]
["GGU PK10 018430","Fenster","Stück","2005-12-01","2099-12-31"]
["GGU PK10 0384","Fenster","Stück","2005-12-01","2099-12-31"]
["GGU PK10 038421","Fenster","Stück","2005-12-01","2099-12-31"]
["GGU PK10 038430","Fenster","Stück","2005-12-01","2099-12-31"]
["GGU SK06 0062","Fenster","Stück","2005-12-01","2099-12-31"]
["GGU SK06 006221","Fenster","Stück","2005-12-01","2099-12-31"]
["GGU SK06 0062D","Fenster","Stück","2005-12-01","2099-12-31"]
["GGU SK06 0062D21A","Fenster","Stück","2005-12-01","2099-12-31"]
["GGU SK06 0066","Fenster","Stück","2005-12-01","2099-12-31"]
["GGU SK06 006621","Fenster","Stück","2005-12-01","2099-12-31"]
["GGU SK06 006630","Fenster","Stück","2005-12-01","2099-12-31"]
["GGU SK06 006640D","Fenster","Stück","2005-12-01","2099-12-31"]
["GGU SK06 0067","Fenster","Stück","2005-12-01","2099-12-31"]
["GGU SK06 006721","Fenster","Stück","2005-12-01","2099-12-31"]
["GGU SK06 006730","Fenster","Stück","2005-12-01","2099-12-31"]
["GGU SK06 0068","Fenster","Stück","2005-12-01","2099-12-31"]
["GGU SK06 006821","Fenster","Stück","2005-12-01","2099-12-31"]
["GGU SK06 006830","Fenster","Stück","2005-12-01","2099-12-31"]
["GGU SK06 0069","Fenster","Stück","2005-12-01","2099-12-31"]
["GGU SK06 006921","Fenster","Stück","2005-12-01","2099-12-31"]
["GGU SK06 006930","Fenster","Stück","2005-12-01","2099-12-31"]
["GGU SK06 0070","Fenster","Stück","2005-12-01","2099-12-31"]
["GGU SK06 007021","Fenster","Stück","2005-12-01","2099-12-31"]
["GGU SK06 007030","Fenster","Stück","2005-12-01","2099-12-31"]
["GGU SK06 007040D","Fenster","Stück","2005-12-01","2099-12-31"]
["GGU SK06 0070Q","Fenster","Stück","2005-12-01","2099-12-31"]
["GGU SK06 008230","Fenster","Stück","2005-12-01","2099-12-31"]
["GGU SK06 0084","Fenster","Stück","2005-12-01","2099-12-31"]
["GGU SK06 008421","Fenster","Stück","2005-12-01","2099-12-31"]
["GGU SK06 008430","Fenster","Stück","2005-12-01","2099-12-31"]
["GGU SK06 0184","Fenster","Stück","2005-12-01","2099-12-31"]
["GGU SK06 018421","Fenster","Stück","2005-12-01","2099-12-31"]
["GGU SK06 018430","Fenster","Stück","2005-12-01","2099-12-31"]
["GGU SK06 0384","Fenster","Stück","2005-12-01","2099-12-31"]
["GGU SK06 038421","Fenster","Stück","2005-12-01","2099-12-31"]
["GGU SK06 038430","Fenster","Stück","2005-12-01","2099-12-31"]
["GGU SK08 0062","Fenster","Stück","2005-12-01","2099-12-31"]
["GGU SK08 006221","Fenster","Stück","2005-12-01","2099-12-31"]
["GGU SK08 0062D","Fenster","Stück","2005-12-01","2099-12-31"]
["GGU SK08 0062D21A","Fenster","Stück","2005-12-01","2099-12-31"]
["GGU SK08 0066","Fenster","Stück","2005-12-01","2099-12-31"]
["GGU SK08 006621","Fenster","Stück","2005-12-01","2099-12-31"]
["GGU SK08 006640D","Fenster","Stück","2005-12-01","2099-12-31"]
["GGU SK08 0067","Fenster","Stück","2005-12-01","2099-12-31"]
["GGU SK08 006721","Fenster","Stück","2005-12-01","2099-12-31"]
["GGU SK08 006730","Fenster","Stück","2005-12-01","2099-12-31"]
["GGU SK08 0068","Fenster","Stück","2005-12-01","2099-12-31"]
["GGU SK08 006821","Fenster","Stück","2005-12-01","2099-12-31"]
["GGU SK08 006830","Fenster","Stück","2005-12-01","2099-12-31"]
["GGU SK08 0069","Fenster","Stück","2005-12-01","2099-12-31"]
["GGU SK08 006921","Fenster","Stück","2005-12-01","2099-12-31"]
["GGU SK08 006930","Fenster","Stück","2005-12-01","2099-12-31"]
["GGU SK08 0070","Fenster","Stück","2005-12-01","2099-12-31"]
["GGU SK08 007021","Fenster","Stück","2005-12-01","2099-12-31"]
["GGU SK08 007030","Fenster","Stück","2005-12-01","2099-12-31"]
["GGU SK08 007040D","Fenster","Stück","2005-12-01","2099-12-31"]
["GGU SK08 0070Q","Fenster","Stück","2005-12-01","2099-12-31"]
["GGU SK08 0084","Fenster","Stück","2005-12-01","2099-12-31"]
["GGU SK08 008421","Fenster","Stück","2005-12-01","2099-12-31"]
["GGU SK08 008430","Fenster","Stück","2005-12-01","2099-12-31"]
["GGU SK08 0184","Fenster","Stück","2005-12-01","2099-12-31"]
["GGU SK08 018421","Fenster","Stück","2005-12-01","2099-12-31"]
["GGU SK08 0384","Fenster","Stück","2005-12-01","2099-12-31"]
["GGU SK10 0066","Fenster","Stück","2005-12-01","2099-12-31"]
["GGU SK10 006621","Fenster","Stück","2005-12-01","2099-12-31"]
["GGU SK10 006630","Fenster","Stück","2005-12-01","2099-12-31"]
["GGU SK10 0067","Fenster","Stück","2005-12-01","2099-12-31"]
["GGU SK10 006721","Fenster","Stück","2005-12-01","2099-12-31"]
["GGU SK10 006730","Fenster","Stück","2005-12-01","2099-12-31"]
["GGU SK10 0068","Fenster","Stück","2005-12-01","2099-12-31"]
["GGU SK10 006821","Fenster","Stück","2005-12-01","2099-12-31"]
["GGU SK10 006830","Fenster","Stück","2005-12-01","2099-12-31"]
["GGU SK10 0069","Fenster","Stück","2005-12-01","2099-12-31"]
["GGU SK10 006921","Fenster","Stück","2005-12-01","2099-12-31"]
["GGU SK10 006930","Fenster","Stück","2005-12-01","2099-12-31"]
["GGU SK10 0070","Fenster","Stück","2005-12-01","2099-12-31"]
["GGU SK10 007021","Fenster","Stück","2005-12-01","2099-12-31"]
["GGU SK10 007030","Fenster","Stück","2005-12-01","2099-12-31"]
["GGU SK10 0084","Fenster","Stück","2005-12-01","2099-12-31"]
["GGU SK10 008421","Fenster","Stück","2005-12-01","2099-12-31"]
["GGU SK10 008430","Fenster","Stück","2005-12-01","2099-12-31"]
["GGU SK10 0184","Fenster","Stück","2005-12-01","2099-12-31"]
["GGU SK10 018421","Fenster","Stück","2005-12-01","2099-12-31"]
["GGU SK10 018430","Fenster","Stück","2005-12-01","2099-12-31"]
["GGU SK10 0384","Fenster","Stück","2005-12-01","2099-12-31"]
["GGU SK10 038421","Fenster","Stück","2005-12-01","2099-12-31"]
["GGU SK10 038430","Fenster","Stück","2005-12-01","2099-12-31"]
["GGU UK04 0066","Fenster","Stück","2005-12-01","2099-12-31"]
["GGU UK04 006621","Fenster","Stück","2005-12-01","2099-12-31"]
["GGU UK04 006630","Fenster","Stück","2005-12-01","2099-12-31"]
["GGU UK04 006640D","Fenster","Stück","2005-12-01","2099-12-31"]
["GGU UK04 0067","Fenster","Stück","2005-12-01","2099-12-31"]
["GGU UK04 006721","Fenster","Stück","2005-12-01","2099-12-31"]
["GGU UK04 006730","Fenster","Stück","2005-12-01","2099-12-31"]
["GGU UK04 0068","Fenster","Stück","2005-12-01","2099-12-31"]
["GGU UK04 006821","Fenster","Stück","2005-12-01","2099-12-31"]
["GGU UK04 006830","Fenster","Stück","2005-12-01","2099-12-31"]
["GGU UK04 0069","Fenster","Stück","2005-12-01","2099-12-31"]
["GGU UK04 006921","Fenster","Stück","2005-12-01","2099-12-31"]
["GGU UK04 006930","Fenster","Stück","2005-12-01","2099-12-31"]
["GGU UK04 0070","Fenster","Stück","2005-12-01","2099-12-31"]
["GGU UK04 007021","Fenster","Stück","2005-12-01","2099-12-31"]
["GGU UK04 007030","Fenster","Stück","2005-12-01","2099-12-31"]
["GGU UK04 007040D","Fenster","Stück","2005-12-01","2099-12-31"]
["GGU UK04 0070Q","Fenster","Stück","2005-12-01","2099-12-31"]
["GGU UK04 0084","Fenster","Stück","2005-12-01","2099-12-31"]
["GGU UK04 008421","Fenster","Stück","2005-12-01","2099-12-31"]
["GGU UK04 008430","Fenster","Stück","2005-12-01","2099-12-31"]
["GGU UK04 0184","Fenster","Stück","2005-12-01","2099-12-31"]
["GGU UK04 018421","Fenster","Stück","2005-12-01","2099-12-31"]
["GGU UK04 018430","Fenster","Stück","2005-12-01","2099-12-31"]
["GGU UK04 0384","Fenster","Stück","2005-12-01","2099-12-31"]
["GGU UK04 038421","Fenster","Stück","2005-12-01","2099-12-31"]
["GGU UK04 038430","Fenster","Stück","2005-12-01","2099-12-31"]
["GGU UK08 0066","Fenster","Stück","2005-12-01","2099-12-31"]
["GGU UK08 006621","Fenster","Stück","2005-12-01","2099-12-31"]
["GGU UK08 006630","Fenster","Stück","2005-12-01","2099-12-31"]
["GGU UK08 006640D","Fenster","Stück","2005-12-01","2099-12-31"]
["GGU UK08 0067","Fenster","Stück","2005-12-01","2099-12-31"]
["GGU UK08 006721","Fenster","Stück","2005-12-01","2099-12-31"]
["GGU UK08 006730","Fenster","Stück","2005-12-01","2099-12-31"]
["GGU UK08 0068","Fenster","Stück","2005-12-01","2099-12-31"]
["GGU UK08 006821","Fenster","Stück","2005-12-01","2099-12-31"]
["GGU UK08 006830","Fenster","Stück","2005-12-01","2099-12-31"]
["GGU UK08 0069","Fenster","Stück","2005-12-01","2099-12-31"]
["GGU UK08 006921","Fenster","Stück","2005-12-01","2099-12-31"]
["GGU UK08 006930","Fenster","Stück","2005-12-01","2099-12-31"]
["GGU UK08 0070","Fenster","Stück","2005-12-01","2099-12-31"]
["GGU UK08 007021","Fenster","Stück","2005-12-01","2099-12-31"]
["GGU UK08 007030","Fenster","Stück","2005-12-01","2099-12-31"]
["GGU UK08 007040D","Fenster","Stück","2005-12-01","2099-12-31"]
["GGU UK08 0070Q","Fenster","Stück","2005-12-01","2099-12-31"]
["GGU UK08 0084","Fenster","Stück","2005-12-01","2099-12-31"]
["GGU UK08 008421","Fenster","Stück","2005-12-01","2099-12-31"]
["GGU UK08 008430","Fenster","Stück","2005-12-01","2099-12-31"]
["GGU UK08 0184","Fenster","Stück","2005-12-01","2099-12-31"]
["GGU UK08 018421","Fenster","Stück","2005-12-01","2099-12-31"]
["GGU UK08 018430","Fenster","Stück","2005-12-01","2099-12-31"]
["GGU UK08 0384","Fenster","Stück","2005-12-01","2099-12-31"]
["GGU UK08 038421","Fenster","Stück","2005-12-01","2099-12-31"]
["GGU UK08 038430","Fenster","Stück","2005-12-01","2099-12-31"]
["GGU UK10 0066","Fenster","Stück","2005-12-01","2099-12-31"]
["GGU UK10 006621","Fenster","Stück","2005-12-01","2099-12-31"]
["GGU UK10 006630","Fenster","Stück","2005-12-01","2099-12-31"]
["GGU UK10 0068","Fenster","Stück","2005-12-01","2099-12-31"]
["GGU UK10 006821","Fenster","Stück","2005-12-01","2099-12-31"]
["GGU UK10 006830","Fenster","Stück","2005-12-01","2099-12-31"]
["GGU UK10 0070","Fenster","Stück","2005-12-01","2099-12-31"]
["GGU UK10 007021","Fenster","Stück","2005-12-01","2099-12-31"]
["GGU UK10 007030","Fenster","Stück","2005-12-01","2099-12-31"]
["GGU UK10 0084","Fenster","Stück","2005-12-01","2099-12-31"]
["GGU UK10 008421","Fenster","Stück","2005-12-01","2099-12-31"]
["GGU UK10 008430","Fenster","Stück","2005-12-01","2099-12-31"]
["GGU UK10 0184","Fenster","Stück","2005-12-01","2099-12-31"]
["GGU UK10 018421","Fenster","Stück","2005-12-01","2099-12-31"]
["GGU UK10 018430","Fenster","Stück","2005-12-01","2099-12-31"]
["GGU UK10 0384","Fenster","Stück","2005-12-01","2099-12-31"]
["GGU UK10 038421","Fenster","Stück","2005-12-01","2099-12-31"]
["GGU UK10 038430","Fenster","Stück","2005-12-01","2099-12-31"]
["GIL MK34 2062","Fenster","Stück","2005-12-01","2099-12-31"]
["GIL MK34 2066","Fenster","Stück","2005-12-01","2099-12-31"]
["GIL MK34 2068","Fenster","Stück","2005-12-01","2099-12-31"]
["GIL MK34 2070","Fenster","Stück","2005-12-01","2099-12-31"]
["GIL MK34 2084","Fenster","Stück","2005-12-01","2099-12-31"]
["GIL MK34 2184","Fenster","Stück","2005-12-01","2099-12-31"]
["GIL MK34 2384","Fenster","Stück","2005-12-01","2099-12-31"]
["GIL MK34 3062","Fenster","Stück","2005-12-01","2099-12-31"]
["GIL MK34 3066","Fenster","Stück","2005-12-01","2099-12-31"]
["GIL MK34 3068","Fenster","Stück","2005-12-01","2099-12-31"]
["GIL MK34 3070","Fenster","Stück","2005-12-01","2099-12-31"]
["GIL MK34 3084","Fenster","Stück","2005-12-01","2099-12-31"]
["GIL MK34 3184","Fenster","Stück","2005-12-01","2099-12-31"]
["GIL MK34 3384","Fenster","Stück","2005-12-01","2099-12-31"]
["GIL PK34 2062","Fenster","Stück","2005-12-01","2099-12-31"]
["GIL PK34 2066","Fenster","Stück","2005-12-01","2099-12-31"]
["GIL PK34 2068","Fenster","Stück","2005-12-01","2099-12-31"]
["GIL PK34 2070","Fenster","Stück","2005-12-01","2099-12-31"]
["GIL PK34 2084","Fenster","Stück","2005-12-01","2099-12-31"]
["GIL PK34 2184","Fenster","Stück","2005-12-01","2099-12-31"]
["GIL PK34 2384","Fenster","Stück","2005-12-01","2099-12-31"]
["GIL PK34 3062","Fenster","Stück","2005-12-01","2099-12-31"]
["GIL PK34 3066","Fenster","Stück","2005-12-01","2099-12-31"]
["GIL PK34 3068","Fenster","Stück","2005-12-01","2099-12-31"]
["GIL PK34 3070","Fenster","Stück","2005-12-01","2099-12-31"]
["GIL PK34 3084","Fenster","Stück","2005-12-01","2099-12-31"]
["GIL PK34 3184","Fenster","Stück","2005-12-01","2099-12-31"]
["GIL PK34 3384","Fenster","Stück","2005-12-01","2099-12-31"]
["GIL SK34 2062","Fenster","Stück","2005-12-01","2099-12-31"]
["GIL SK34 2066","Fenster","Stück","2005-12-01","2099-12-31"]
["GIL SK34 2068","Fenster","Stück","2005-12-01","2099-12-31"]
["GIL SK34 2070","Fenster","Stück","2005-12-01","2099-12-31"]
["GIL SK34 2084","Fenster","Stück","2005-12-01","2099-12-31"]
["GIL SK34 2184","Fenster","Stück","2005-12-01","2099-12-31"]
["GIL SK34 2384","Fenster","Stück","2005-12-01","2099-12-31"]
["GIL SK34 3062","Fenster","Stück","2005-12-01","2099-12-31"]
["GIL SK34 3066","Fenster","Stück","2005-12-01","2099-12-31"]
["GIL SK34 3068","Fenster","Stück","2005-12-01","2099-12-31"]
["GIL SK34 3070","Fenster","Stück","2005-12-01","2099-12-31"]
["GIL SK34 3084","Fenster","Stück","2005-12-01","2099-12-31"]
["GIL SK34 3184","Fenster","Stück","2005-12-01","2099-12-31"]
["GIL SK34 3384","Fenster","Stück","2005-12-01","2099-12-31"]
["GIL UK34 2062","Fenster","Stück","2005-12-01","2099-12-31"]
["GIL UK34 2066","Fenster","Stück","2005-12-01","2099-12-31"]
["GIL UK34 2068","Fenster","Stück","2005-12-01","2099-12-31"]
["GIL UK34 2070","Fenster","Stück","2005-12-01","2099-12-31"]
["GIL UK34 2084","Fenster","Stück","2005-12-01","2099-12-31"]
["GIL UK34 2184","Fenster","Stück","2005-12-01","2099-12-31"]
["GIL UK34 2384","Fenster","Stück","2005-12-01","2099-12-31"]
["GIL UK34 3062","Fenster","Stück","2005-12-01","2099-12-31"]
["GIL UK34 3066","Fenster","Stück","2005-12-01","2099-12-31"]
["GIL UK34 3068","Fenster","Stück","2005-12-01","2099-12-31"]
["GIL UK34 3070","Fenster","Stück","2005-12-01","2099-12-31"]
["GIL UK34 3084","Fenster","Stück","2005-12-01","2099-12-31"]
["GIL UK34 3184","Fenster","Stück","2005-12-01","2099-12-31"]
["GIL UK34 3384","Fenster","Stück","2005-12-01","2099-12-31"]
["GIU FK34 0062","Fenster","Stück","2005-12-01","2099-12-31"]
["GIU FK34 0066","Fenster","Stück","2005-12-01","2099-12-31"]
["GIU FK34 0068","Fenster","Stück","2005-12-01","2099-12-31"]
["GIU FK34 0070","Fenster","Stück","2005-12-01","2099-12-31"]
["GIU FK34 0084","Fenster","Stück","2005-12-01","2099-12-31"]
["GIU FK34 0162","Fenster","Stück","2005-12-01","2099-12-31"]
["GIU FK34 0166","Fenster","Stück","2005-12-01","2099-12-31"]
["GIU FK34 0168","Fenster","Stück","2005-12-01","2099-12-31"]
["GIU FK34 0170","Fenster","Stück","2005-12-01","2099-12-31"]
["GIU FK34 0184","Fenster","Stück","2005-12-01","2099-12-31"]
["GIU FK34 0362","Fenster","Stück","2005-12-01","2099-12-31"]
["GIU FK34 0366","Fenster","Stück","2005-12-01","2099-12-31"]
["GIU FK34 0370","Fenster","Stück","2005-12-01","2099-12-31"]
["GIU FK34 0384","Fenster","Stück","2005-12-01","2099-12-31"]
["GIU MK34 0062","Fenster","Stück","2005-12-01","2099-12-31"]
["GIU MK34 0066","Fenster","Stück","2005-12-01","2099-12-31"]
["GIU MK34 0068","Fenster","Stück","2005-12-01","2099-12-31"]
["GIU MK34 0070","Fenster","Stück","2005-12-01","2099-12-31"]
["GIU MK34 0084","Fenster","Stück","2005-12-01","2099-12-31"]
["GIU MK34 0184","Fenster","Stück","2005-12-01","2099-12-31"]
["GIU MK34 0384","Fenster","Stück","2005-12-01","2099-12-31"]
["GIU PK34 0062","Fenster","Stück","2005-12-01","2099-12-31"]
["GIU PK34 0066","Fenster","Stück","2005-12-01","2099-12-31"]
["GIU PK34 0068","Fenster","Stück","2005-12-01","2099-12-31"]
["GIU PK34 0070","Fenster","Stück","2005-12-01","2099-12-31"]
["GIU PK34 0084","Fenster","Stück","2005-12-01","2099-12-31"]
["GIU PK34 0184","Fenster","Stück","2005-12-01","2099-12-31"]
["GIU PK34 0384","Fenster","Stück","2005-12-01","2099-12-31"]
["GIU SK34 0062","Fenster","Stück","2005-12-01","2099-12-31"]
["GIU SK34 0066","Fenster","Stück","2005-12-01","2099-12-31"]
["GIU SK34 0068","Fenster","Stück","2005-12-01","2099-12-31"]
["GIU SK34 0070","Fenster","Stück","2005-12-01","2099-12-31"]
["GIU SK34 0084","Fenster","Stück","2005-12-01","2099-12-31"]
["GIU SK34 0184","Fenster","Stück","2005-12-01","2099-12-31"]
["GIU SK34 0384","Fenster","Stück","2005-12-01","2099-12-31"]
["GIU UK34 0062","Fenster","Stück","2005-12-01","2099-12-31"]
["GIU UK34 0066","Fenster","Stück","2005-12-01","2099-12-31"]
["GIU UK34 0068","Fenster","Stück","2005-12-01","2099-12-31"]
["GIU UK34 0070","Fenster","Stück","2005-12-01","2099-12-31"]
["GIU UK34 0084","Fenster","Stück","2005-12-01","2099-12-31"]
["GIU UK34 0184","Fenster","Stück","2005-12-01","2099-12-31"]
["GIU UK34 0384","Fenster","Stück","2005-12-01","2099-12-31"]
["GPL CK04 2066","Fenster","Stück","2005-12-01","2099-12-31"]
["GPL CK04 2067","Fenster","Stück","2005-12-01","2099-12-31"]
["GPL CK04 2068","Fenster","Stück","2005-12-01","2099-12-31"]
["GPL CK04 2069","Fenster","Stück","2005-12-01","2099-12-31"]
["GPL CK04 2070","Fenster","Stück","2005-12-01","2099-12-31"]
["GPL CK04 2084","Fenster","Stück","2005-12-01","2099-12-31"]
["GPL CK04 2184","Fenster","Stück","2005-12-01","2099-12-31"]
["GPL CK04 2384","Fenster","Stück","2005-12-01","2099-12-31"]
["GPL CK04 3066","Fenster","Stück","2005-12-01","2099-12-31"]
["GPL CK04 3067","Fenster","Stück","2005-12-01","2099-12-31"]
["GPL CK04 3068","Fenster","Stück","2005-12-01","2099-12-31"]
["GPL CK04 3069","Fenster","Stück","2005-12-01","2099-12-31"]
["GPL CK04 3070","Fenster","Stück","2005-12-01","2099-12-31"]
["GPL CK04 3084","Fenster","Stück","2005-12-01","2099-12-31"]
["GPL CK04 3184","Fenster","Stück","2005-12-01","2099-12-31"]
["GPL CK04 3384","Fenster","Stück","2005-12-01","2099-12-31"]
["GPL CK06 2066","Fenster","Stück","2005-12-01","2099-12-31"]
["GPL CK06 2067","Fenster","Stück","2005-12-01","2099-12-31"]
["GPL CK06 2068","Fenster","Stück","2005-12-01","2099-12-31"]
["GPL CK06 2069","Fenster","Stück","2005-12-01","2099-12-31"]
["GPL CK06 2070","Fenster","Stück","2005-12-01","2099-12-31"]
["GPL CK06 2084","Fenster","Stück","2005-12-01","2099-12-31"]
["GPL CK06 2184","Fenster","Stück","2005-12-01","2099-12-31"]
["GPL CK06 2384","Fenster","Stück","2005-12-01","2099-12-31"]
["GPL CK06 3066","Fenster","Stück","2005-12-01","2099-12-31"]
["GPL CK06 3067","Fenster","Stück","2005-12-01","2099-12-31"]
["GPL CK06 3068","Fenster","Stück","2005-12-01","2099-12-31"]
["GPL CK06 3069","Fenster","Stück","2005-12-01","2099-12-31"]
["GPL CK06 3070","Fenster","Stück","2005-12-01","2099-12-31"]
["GPL CK06 3084","Fenster","Stück","2005-12-01","2099-12-31"]
["GPL CK06 3184","Fenster","Stück","2005-12-01","2099-12-31"]
["GPL CK06 3384","Fenster","Stück","2005-12-01","2099-12-31"]
["GPL FK06 2066","Fenster","Stück","2005-12-01","2099-12-31"]
["GPL FK06 2067","Fenster","Stück","2005-12-01","2099-12-31"]
["GPL FK06 2068","Fenster","Stück","2005-12-01","2099-12-31"]
["GPL FK06 2069","Fenster","Stück","2005-12-01","2099-12-31"]
["GPL FK06 2070","Fenster","Stück","2005-12-01","2099-12-31"]
["GPL FK06 2084","Fenster","Stück","2005-12-01","2099-12-31"]
["GPL FK06 2184","Fenster","Stück","2005-12-01","2099-12-31"]
["GPL FK06 2384","Fenster","Stück","2005-12-01","2099-12-31"]
["GPL FK06 3066","Fenster","Stück","2005-12-01","2099-12-31"]
["GPL FK06 3067","Fenster","Stück","2005-12-01","2099-12-31"]
["GPL FK06 3068","Fenster","Stück","2005-12-01","2099-12-31"]
["GPL FK06 3069","Fenster","Stück","2005-12-01","2099-12-31"]
["GPL FK06 3070","Fenster","Stück","2005-12-01","2099-12-31"]
["GPL FK06 3084","Fenster","Stück","2005-12-01","2099-12-31"]
["GPL FK06 3184","Fenster","Stück","2005-12-01","2099-12-31"]
["GPL FK08 2066","Fenster","Stück","2005-12-01","2099-12-31"]
["GPL FK08 2067","Fenster","Stück","2005-12-01","2099-12-31"]
["GPL FK08 2068","Fenster","Stück","2005-12-01","2099-12-31"]
["GPL FK08 2069","Fenster","Stück","2005-12-01","2099-12-31"]
["GPL FK08 2070","Fenster","Stück","2005-12-01","2099-12-31"]
["GPL FK08 2084","Fenster","Stück","2005-12-01","2099-12-31"]
["GPL FK08 2184","Fenster","Stück","2005-12-01","2099-12-31"]
["GPL FK08 2384","Fenster","Stück","2005-12-01","2099-12-31"]
["GPL FK08 3066","Fenster","Stück","2005-12-01","2099-12-31"]
["GPL FK08 3067","Fenster","Stück","2005-12-01","2099-12-31"]
["GPL FK08 3068","Fenster","Stück","2005-12-01","2099-12-31"]
["GPL FK08 3069","Fenster","Stück","2005-12-01","2099-12-31"]
["GPL FK08 3070","Fenster","Stück","2005-12-01","2099-12-31"]
["GPL FK08 3084","Fenster","Stück","2005-12-01","2099-12-31"]
["GPL FK08 3184","Fenster","Stück","2005-12-01","2099-12-31"]
["GPL MK04 2066","Fenster","Stück","2005-12-01","2099-12-31"]
["GPL MK04 2067","Fenster","Stück","2005-12-01","2099-12-31"]
["GPL MK04 2068","Fenster","Stück","2005-12-01","2099-12-31"]
["GPL MK04 2069","Fenster","Stück","2005-12-01","2099-12-31"]
["GPL MK04 2070","Fenster","Stück","2005-12-01","2099-12-31"]
["GPL MK04 2084","Fenster","Stück","2005-12-01","2099-12-31"]
["GPL MK04 2184","Fenster","Stück","2005-12-01","2099-12-31"]
["GPL MK04 2384","Fenster","Stück","2005-12-01","2099-12-31"]
["GPL MK04 3066","Fenster","Stück","2005-12-01","2099-12-31"]
["GPL MK04 3067","Fenster","Stück","2005-12-01","2099-12-31"]
["GPL MK04 3068","Fenster","Stück","2005-12-01","2099-12-31"]
["GPL MK04 3069","Fenster","Stück","2005-12-01","2099-12-31"]
["GPL MK04 3070","Fenster","Stück","2005-12-01","2099-12-31"]
["GPL MK04 3084","Fenster","Stück","2005-12-01","2099-12-31"]
["GPL MK04 3184","Fenster","Stück","2005-12-01","2099-12-31"]
["GPL MK04 3384","Fenster","Stück","2005-12-01","2099-12-31"]
["GPL MK06 2066","Fenster","Stück","2005-12-01","2099-12-31"]
["GPL MK06 2067","Fenster","Stück","2005-12-01","2099-12-31"]
["GPL MK06 2068","Fenster","Stück","2005-12-01","2099-12-31"]
["GPL MK06 2069","Fenster","Stück","2005-12-01","2099-12-31"]
["GPL MK06 2070","Fenster","Stück","2005-12-01","2099-12-31"]
["GPL MK06 2084","Fenster","Stück","2005-12-01","2099-12-31"]
["GPL MK06 2184","Fenster","Stück","2005-12-01","2099-12-31"]
["GPL MK06 2384","Fenster","Stück","2005-12-01","2099-12-31"]
["GPL MK06 3066","Fenster","Stück","2005-12-01","2099-12-31"]
["GPL MK06 3067","Fenster","Stück","2005-12-01","2099-12-31"]
["GPL MK06 3068","Fenster","Stück","2005-12-01","2099-12-31"]
["GPL MK06 3069","Fenster","Stück","2005-12-01","2099-12-31"]
["GPL MK06 3070","Fenster","Stück","2005-12-01","2099-12-31"]
["GPL MK06 3084","Fenster","Stück","2005-12-01","2099-12-31"]
["GPL MK06 3184","Fenster","Stück","2005-12-01","2099-12-31"]
["GPL MK06 3384","Fenster","Stück","2005-12-01","2099-12-31"]
["GPL MK08 2066","Fenster","Stück","2005-12-01","2099-12-31"]
["GPL MK08 2067","Fenster","Stück","2005-12-01","2099-12-31"]
["GPL MK08 2068","Fenster","Stück","2005-12-01","2099-12-31"]
["GPL MK08 2069","Fenster","Stück","2005-12-01","2099-12-31"]
["GPL MK08 2070","Fenster","Stück","2005-12-01","2099-12-31"]
["GPL MK08 2084","Fenster","Stück","2005-12-01","2099-12-31"]
["GPL MK08 2184","Fenster","Stück","2005-12-01","2099-12-31"]
["GPL MK08 2384","Fenster","Stück","2005-12-01","2099-12-31"]
["GPL MK08 3066","Fenster","Stück","2005-12-01","2099-12-31"]
["GPL MK08 3067","Fenster","Stück","2005-12-01","2099-12-31"]
["GPL MK08 3068","Fenster","Stück","2005-12-01","2099-12-31"]
["GPL MK08 3069","Fenster","Stück","2005-12-01","2099-12-31"]
["GPL MK08 3070","Fenster","Stück","2005-12-01","2099-12-31"]
["GPL MK08 3084","Fenster","Stück","2005-12-01","2099-12-31"]
["GPL MK08 3184","Fenster","Stück","2005-12-01","2099-12-31"]
["GPL MK08 3384","Fenster","Stück","2005-12-01","2099-12-31"]
["GPL MK10 2066","Fenster","Stück","2005-12-01","2099-12-31"]
["GPL MK10 2067","Fenster","Stück","2005-12-01","2099-12-31"]
["GPL MK10 2068","Fenster","Stück","2005-12-01","2099-12-31"]
["GPL MK10 2069","Fenster","Stück","2005-12-01","2099-12-31"]
["GPL MK10 2070","Fenster","Stück","2005-12-01","2099-12-31"]
["GPL MK10 2084","Fenster","Stück","2005-12-01","2099-12-31"]
["GPL MK10 2184","Fenster","Stück","2005-12-01","2099-12-31"]
["GPL MK10 2384","Fenster","Stück","2005-12-01","2099-12-31"]
["GPL MK10 3066","Fenster","Stück","2005-12-01","2099-12-31"]
["GPL MK10 3067","Fenster","Stück","2005-12-01","2099-12-31"]
["GPL MK10 3068","Fenster","Stück","2005-12-01","2099-12-31"]
["GPL MK10 3069","Fenster","Stück","2005-12-01","2099-12-31"]
["GPL MK10 3070","Fenster","Stück","2005-12-01","2099-12-31"]
["GPL MK10 3084","Fenster","Stück","2005-12-01","2099-12-31"]
["GPL MK10 3184","Fenster","Stück","2005-12-01","2099-12-31"]
["GPL PK06 2066","Fenster","Stück","2005-12-01","2099-12-31"]
["GPL PK06 2067","Fenster","Stück","2005-12-01","2099-12-31"]
["GPL PK06 2068","Fenster","Stück","2005-12-01","2099-12-31"]
["GPL PK06 2069","Fenster","Stück","2005-12-01","2099-12-31"]
["GPL PK06 2070","Fenster","Stück","2005-12-01","2099-12-31"]
["GPL PK06 2084","Fenster","Stück","2005-12-01","2099-12-31"]
["GPL PK06 2184","Fenster","Stück","2005-12-01","2099-12-31"]
["GPL PK06 2384","Fenster","Stück","2005-12-01","2099-12-31"]
["GPL PK06 3066","Fenster","Stück","2005-12-01","2099-12-31"]
["GPL PK06 3067","Fenster","Stück","2005-12-01","2099-12-31"]
["GPL PK06 3068","Fenster","Stück","2005-12-01","2099-12-31"]
["GPL PK06 3069","Fenster","Stück","2005-12-01","2099-12-31"]
["GPL PK06 3070","Fenster","Stück","2005-12-01","2099-12-31"]
["GPL PK06 3084","Fenster","Stück","2005-12-01","2099-12-31"]
["GPL PK06 3184","Fenster","Stück","2005-12-01","2099-12-31"]
["GPL PK08 2066","Fenster","Stück","2005-12-01","2099-12-31"]
["GPL PK08 2067","Fenster","Stück","2005-12-01","2099-12-31"]
["GPL PK08 2068","Fenster","Stück","2005-12-01","2099-12-31"]
["GPL PK08 2069","Fenster","Stück","2005-12-01","2099-12-31"]
["GPL PK08 2070","Fenster","Stück","2005-12-01","2099-12-31"]
["GPL PK08 2084","Fenster","Stück","2005-12-01","2099-12-31"]
["GPL PK08 2184","Fenster","Stück","2005-12-01","2099-12-31"]
["GPL PK08 2384","Fenster","Stück","2005-12-01","2099-12-31"]
["GPL PK08 3066","Fenster","Stück","2005-12-01","2099-12-31"]
["GPL PK08 3067","Fenster","Stück","2005-12-01","2099-12-31"]
["GPL PK08 3068","Fenster","Stück","2005-12-01","2099-12-31"]
["GPL PK08 3069","Fenster","Stück","2005-12-01","2099-12-31"]
["GPL PK08 3070","Fenster","Stück","2005-12-01","2099-12-31"]
["GPL PK08 3084","Fenster","Stück","2005-12-01","2099-12-31"]
["GPL PK08 3184","Fenster","Stück","2005-12-01","2099-12-31"]
["GPL PK10 2066","Fenster","Stück","2005-12-01","2099-12-31"]
["GPL PK10 2067","Fenster","Stück","2005-12-01","2099-12-31"]
["GPL PK10 2068","Fenster","Stück","2005-12-01","2099-12-31"]
["GPL PK10 2069","Fenster","Stück","2005-12-01","2099-12-31"]
["GPL PK10 2070","Fenster","Stück","2005-12-01","2099-12-31"]
["GPL PK10 2084","Fenster","Stück","2005-12-01","2099-12-31"]
["GPL PK10 2184","Fenster","Stück","2005-12-01","2099-12-31"]
["GPL PK10 2384","Fenster","Stück","2005-12-01","2099-12-31"]
["GPL PK10 3066","Fenster","Stück","2005-12-01","2099-12-31"]
["GPL PK10 3067","Fenster","Stück","2005-12-01","2099-12-31"]
["GPL PK10 3068","Fenster","Stück","2005-12-01","2099-12-31"]
["GPL PK10 3069","Fenster","Stück","2005-12-01","2099-12-31"]
["GPL PK10 3070","Fenster","Stück","2005-12-01","2099-12-31"]
["GPL PK10 3084","Fenster","Stück","2005-12-01","2099-12-31"]
["GPL PK10 3184","Fenster","Stück","2005-12-01","2099-12-31"]
["GPL SK06 2066","Fenster","Stück","2005-12-01","2099-12-31"]
["GPL SK06 2067","Fenster","Stück","2005-12-01","2099-12-31"]
["GPL SK06 2068","Fenster","Stück","2005-12-01","2099-12-31"]
["GPL SK06 2069","Fenster","Stück","2005-12-01","2099-12-31"]
["GPL SK06 2070","Fenster","Stück","2005-12-01","2099-12-31"]
["GPL SK06 2084","Fenster","Stück","2005-12-01","2099-12-31"]
["GPL SK06 2184","Fenster","Stück","2005-12-01","2099-12-31"]
["GPL SK06 2384","Fenster","Stück","2005-12-01","2099-12-31"]
["GPL SK06 3066","Fenster","Stück","2005-12-01","2099-12-31"]
["GPL SK06 3067","Fenster","Stück","2005-12-01","2099-12-31"]
["GPL SK06 3068","Fenster","Stück","2005-12-01","2099-12-31"]
["GPL SK06 3069","Fenster","Stück","2005-12-01","2099-12-31"]
["GPL SK06 3070","Fenster","Stück","2005-12-01","2099-12-31"]
["GPL SK06 3084","Fenster","Stück","2005-12-01","2099-12-31"]
["GPL SK06 3184","Fenster","Stück","2005-12-01","2099-12-31"]
["GPL SK06 3384","Fenster","Stück","2005-12-01","2099-12-31"]
["GPL SK08 2066","Fenster","Stück","2005-12-01","2099-12-31"]
["GPL SK08 2067","Fenster","Stück","2005-12-01","2099-12-31"]
["GPL SK08 2068","Fenster","Stück","2005-12-01","2099-12-31"]
["GPL SK08 2069","Fenster","Stück","2005-12-01","2099-12-31"]
["GPL SK08 2070","Fenster","Stück","2005-12-01","2099-12-31"]
["GPL SK08 2084","Fenster","Stück","2005-12-01","2099-12-31"]
["GPL SK08 2184","Fenster","Stück","2005-12-01","2099-12-31"]
["GPL SK08 2384","Fenster","Stück","2005-12-01","2099-12-31"]
["GPL SK08 3066","Fenster","Stück","2005-12-01","2099-12-31"]
["GPL SK08 3067","Fenster","Stück","2005-12-01","2099-12-31"]
["GPL SK08 3068","Fenster","Stück","2005-12-01","2099-12-31"]
["GPL SK08 3069","Fenster","Stück","2005-12-01","2099-12-31"]
["GPL SK08 3070","Fenster","Stück","2005-12-01","2099-12-31"]
["GPL SK08 3084","Fenster","Stück","2005-12-01","2099-12-31"]
["GPL SK08 3184","Fenster","Stück","2005-12-01","2099-12-31"]
["GPL SK10 2066","Fenster","Stück","2005-12-01","2099-12-31"]
["GPL SK10 2067","Fenster","Stück","2005-12-01","2099-12-31"]
["GPL SK10 2068","Fenster","Stück","2005-12-01","2099-12-31"]
["GPL SK10 2069","Fenster","Stück","2005-12-01","2099-12-31"]
["GPL SK10 2070","Fenster","Stück","2005-12-01","2099-12-31"]
["GPL SK10 2084","Fenster","Stück","2005-12-01","2099-12-31"]
["GPL SK10 2184","Fenster","Stück","2005-12-01","2099-12-31"]
["GPL SK10 2384","Fenster","Stück","2005-12-01","2099-12-31"]
["GPL SK10 3066","Fenster","Stück","2005-12-01","2099-12-31"]
["GPL SK10 3067","Fenster","Stück","2005-12-01","2099-12-31"]
["GPL SK10 3068","Fenster","Stück","2005-12-01","2099-12-31"]
["GPL SK10 3069","Fenster","Stück","2005-12-01","2099-12-31"]
["GPL SK10 3070","Fenster","Stück","2005-12-01","2099-12-31"]
["GPL SK10 3084","Fenster","Stück","2005-12-01","2099-12-31"]
["GPL SK10 3184","Fenster","Stück","2005-12-01","2099-12-31"]
["GPL UK04 2066","Fenster","Stück","2005-12-01","2099-12-31"]
["GPL UK04 2067","Fenster","Stück","2005-12-01","2099-12-31"]
["GPL UK04 2068","Fenster","Stück","2005-12-01","2099-12-31"]
["GPL UK04 2069","Fenster","Stück","2005-12-01","2099-12-31"]
["GPL UK04 2070","Fenster","Stück","2005-12-01","2099-12-31"]
["GPL UK04 2084","Fenster","Stück","2005-12-01","2099-12-31"]
["GPL UK04 2184","Fenster","Stück","2005-12-01","2099-12-31"]
["GPL UK04 2384","Fenster","Stück","2005-12-01","2099-12-31"]
["GPL UK04 3066","Fenster","Stück","2005-12-01","2099-12-31"]
["GPL UK04 3067","Fenster","Stück","2005-12-01","2099-12-31"]
["GPL UK04 3068","Fenster","Stück","2005-12-01","2099-12-31"]
["GPL UK04 3069","Fenster","Stück","2005-12-01","2099-12-31"]
["GPL UK04 3070","Fenster","Stück","2005-12-01","2099-12-31"]
["GPL UK04 3084","Fenster","Stück","2005-12-01","2099-12-31"]
["GPL UK04 3184","Fenster","Stück","2005-12-01","2099-12-31"]
["GPL UK04 3384","Fenster","Stück","2005-12-01","2099-12-31"]
["GPL UK08 2066","Fenster","Stück","2005-12-01","2099-12-31"]
["GPL UK08 2067","Fenster","Stück","2005-12-01","2099-12-31"]
["GPL UK08 2068","Fenster","Stück","2005-12-01","2099-12-31"]
["GPL UK08 2069","Fenster","Stück","2005-12-01","2099-12-31"]
["GPL UK08 2070","Fenster","Stück","2005-12-01","2099-12-31"]
["GPL UK08 2084","Fenster","Stück","2005-12-01","2099-12-31"]
["GPL UK08 2184","Fenster","Stück","2005-12-01","2099-12-31"]
["GPL UK08 2384","Fenster","Stück","2005-12-01","2099-12-31"]
["GPL UK08 3066","Fenster","Stück","2005-12-01","2099-12-31"]
["GPL UK08 3067","Fenster","Stück","2005-12-01","2099-12-31"]
["GPL UK08 3068","Fenster","Stück","2005-12-01","2099-12-31"]
["GPL UK08 3069","Fenster","Stück","2005-12-01","2099-12-31"]
["GPL UK08 3070","Fenster","Stück","2005-12-01","2099-12-31"]
["GPL UK08 3084","Fenster","Stück","2005-12-01","2099-12-31"]
["GPL UK08 3184","Fenster","Stück","2005-12-01","2099-12-31"]
["GPLS FFKF06 2066","Fenster","Stück","2005-12-01","2099-12-31"]
["GPLS FFKF06 2070","Fenster","Stück","2005-12-01","2099-12-31"]
["GPLS FFKF06 2166","Fenster","Stück","2005-12-01","2099-12-31"]
["GPLS FFKF06 2170","Fenster","Stück","2005-12-01","2099-12-31"]
["GPLS FFKF08 2066","Fenster","Stück","2005-12-01","2099-12-31"]
["GPLS FFKF08 2070","Fenster","Stück","2005-12-01","2099-12-31"]
["GPLS FFKF08 2166","Fenster","Stück","2005-12-01","2099-12-31"]
["GPLS FFKF08 2170","Fenster","Stück","2005-12-01","2099-12-31"]
["GPU CK04 0062","Fenster","Stück","2005-12-01","2099-12-31"]
["GPU CK04 0066","Fenster","Stück","2005-12-01","2099-12-31"]
["GPU CK04 0067","Fenster","Stück","2005-12-01","2099-12-31"]
["GPU CK04 0068","Fenster","Stück","2005-12-01","2099-12-31"]
["GPU CK04 0069","Fenster","Stück","2005-12-01","2099-12-31"]
["GPU CK04 0070","Fenster","Stück","2005-12-01","2099-12-31"]
["GPU CK04 0084","Fenster","Stück","2005-12-01","2099-12-31"]
["GPU CK04 0184","Fenster","Stück","2005-12-01","2099-12-31"]
["GPU CK04 0384","Fenster","Stück","2005-12-01","2099-12-31"]
["GPU CK06 0062","Fenster","Stück","2005-12-01","2099-12-31"]
["GPU CK06 0066","Fenster","Stück","2005-12-01","2099-12-31"]
["GPU CK06 0067","Fenster","Stück","2005-12-01","2099-12-31"]
["GPU CK06 0068","Fenster","Stück","2005-12-01","2099-12-31"]
["GPU CK06 0069","Fenster","Stück","2005-12-01","2099-12-31"]
["GPU CK06 0070","Fenster","Stück","2005-12-01","2099-12-31"]
["GPU CK06 0084","Fenster","Stück","2005-12-01","2099-12-31"]
["GPU CK06 0184","Fenster","Stück","2005-12-01","2099-12-31"]
["GPU CK06 0384","Fenster","Stück","2005-12-01","2099-12-31"]
["GPU FK06 0062","Fenster","Stück","2005-12-01","2099-12-31"]
["GPU FK06 0066","Fenster","Stück","2005-12-01","2099-12-31"]
["GPU FK06 006621","Fenster","Stück","2005-12-01","2099-12-31"]
["GPU FK06 0067","Fenster","Stück","2005-12-01","2099-12-31"]
["GPU FK06 0068","Fenster","Stück","2005-12-01","2099-12-31"]
["GPU FK06 0069","Fenster","Stück","2005-12-01","2099-12-31"]
["GPU FK06 0070","Fenster","Stück","2005-12-01","2099-12-31"]
["GPU FK06 007021","Fenster","Stück","2005-12-01","2099-12-31"]
["GPU FK06 0084","Fenster","Stück","2005-12-01","2099-12-31"]
["GPU FK06 0184","Fenster","Stück","2005-12-01","2099-12-31"]
["GPU FK06 0384","Fenster","Stück","2005-12-01","2099-12-31"]
["GPU FK08 0062","Fenster","Stück","2005-12-01","2099-12-31"]
["GPU FK08 0066","Fenster","Stück","2005-12-01","2099-12-31"]
["GPU FK08 006621","Fenster","Stück","2005-12-01","2099-12-31"]
["GPU FK08 0067","Fenster","Stück","2005-12-01","2099-12-31"]
["GPU FK08 0068","Fenster","Stück","2005-12-01","2099-12-31"]
["GPU FK08 0069","Fenster","Stück","2005-12-01","2099-12-31"]
["GPU FK08 0070","Fenster","Stück","2005-12-01","2099-12-31"]
["GPU FK08 007021","Fenster","Stück","2005-12-01","2099-12-31"]
["GPU FK08 0084","Fenster","Stück","2005-12-01","2099-12-31"]
["GPU FK08 0184","Fenster","Stück","2005-12-01","2099-12-31"]
["GPU FK08 0384","Fenster","Stück","2005-12-01","2099-12-31"]
["GPU MK04 0062","Fenster","Stück","2005-12-01","2099-12-31"]
["GPU MK04 0066","Fenster","Stück","2005-12-01","2099-12-31"]
["GPU MK04 0067","Fenster","Stück","2005-12-01","2099-12-31"]
["GPU MK04 0068","Fenster","Stück","2005-12-01","2099-12-31"]
["GPU MK04 0069","Fenster","Stück","2005-12-01","2099-12-31"]
["GPU MK04 0070","Fenster","Stück","2005-12-01","2099-12-31"]
["GPU MK04 0084","Fenster","Stück","2005-12-01","2099-12-31"]
["GPU MK04 0184","Fenster","Stück","2005-12-01","2099-12-31"]
["GPU MK04 0384","Fenster","Stück","2005-12-01","2099-12-31"]
["GPU MK06 0062","Fenster","Stück","2005-12-01","2099-12-31"]
["GPU MK06 0066","Fenster","Stück","2005-12-01","2099-12-31"]
["GPU MK06 006621","Fenster","Stück","2005-12-01","2099-12-31"]
["GPU MK06 0067","Fenster","Stück","2005-12-01","2099-12-31"]
["GPU MK06 0068","Fenster","Stück","2005-12-01","2099-12-31"]
["GPU MK06 0069","Fenster","Stück","2005-12-01","2099-12-31"]
["GPU MK06 0070","Fenster","Stück","2005-12-01","2099-12-31"]
["GPU MK06 007021","Fenster","Stück","2005-12-01","2099-12-31"]
["GPU MK06 0084","Fenster","Stück","2005-12-01","2099-12-31"]
["GPU MK06 0184","Fenster","Stück","2005-12-01","2099-12-31"]
["GPU MK06 0384","Fenster","Stück","2005-12-01","2099-12-31"]
["GPU MK08 0062","Fenster","Stück","2005-12-01","2099-12-31"]
["GPU MK08 0066","Fenster","Stück","2005-12-01","2099-12-31"]
["GPU MK08 006621","Fenster","Stück","2005-12-01","2099-12-31"]
["GPU MK08 0067","Fenster","Stück","2005-12-01","2099-12-31"]
["GPU MK08 0068","Fenster","Stück","2005-12-01","2099-12-31"]
["GPU MK08 0069","Fenster","Stück","2005-12-01","2099-12-31"]
["GPU MK08 0070","Fenster","Stück","2005-12-01","2099-12-31"]
["GPU MK08 007021","Fenster","Stück","2005-12-01","2099-12-31"]
["GPU MK08 0084","Fenster","Stück","2005-12-01","2099-12-31"]
["GPU MK08 0184","Fenster","Stück","2005-12-01","2099-12-31"]
["GPU MK08 0384","Fenster","Stück","2005-12-01","2099-12-31"]
["GPU MK10 0062","Fenster","Stück","2005-12-01","2099-12-31"]
["GPU MK10 0066","Fenster","Stück","2005-12-01","2099-12-31"]
["GPU MK10 0067","Fenster","Stück","2005-12-01","2099-12-31"]
["GPU MK10 0068","Fenster","Stück","2005-12-01","2099-12-31"]
["GPU MK10 0069","Fenster","Stück","2005-12-01","2099-12-31"]
["GPU MK10 0070","Fenster","Stück","2005-12-01","2099-12-31"]
["GPU MK10 0084","Fenster","Stück","2005-12-01","2099-12-31"]
["GPU MK10 0184","Fenster","Stück","2005-12-01","2099-12-31"]
["GPU MK10 0384","Fenster","Stück","2005-12-01","2099-12-31"]
["GPU PK06 0062","Fenster","Stück","2005-12-01","2099-12-31"]
["GPU PK06 0066","Fenster","Stück","2005-12-01","2099-12-31"]
["GPU PK06 006621","Fenster","Stück","2005-12-01","2099-12-31"]
["GPU PK06 0067","Fenster","Stück","2005-12-01","2099-12-31"]
["GPU PK06 0068","Fenster","Stück","2005-12-01","2099-12-31"]
["GPU PK06 0069","Fenster","Stück","2005-12-01","2099-12-31"]
["GPU PK06 0070","Fenster","Stück","2005-12-01","2099-12-31"]
["GPU PK06 007021","Fenster","Stück","2005-12-01","2099-12-31"]
["GPU PK06 0084","Fenster","Stück","2005-12-01","2099-12-31"]
["GPU PK06 0184","Fenster","Stück","2005-12-01","2099-12-31"]
["GPU PK06 0384","Fenster","Stück","2005-12-01","2099-12-31"]
["GPU PK08 0062","Fenster","Stück","2005-12-01","2099-12-31"]
["GPU PK08 0066","Fenster","Stück","2005-12-01","2099-12-31"]
["GPU PK08 006621","Fenster","Stück","2005-12-01","2099-12-31"]
["GPU PK08 0067","Fenster","Stück","2005-12-01","2099-12-31"]
["GPU PK08 0068","Fenster","Stück","2005-12-01","2099-12-31"]
["GPU PK08 0069","Fenster","Stück","2005-12-01","2099-12-31"]
["GPU PK08 0070","Fenster","Stück","2005-12-01","2099-12-31"]
["GPU PK08 007021","Fenster","Stück","2005-12-01","2099-12-31"]
["GPU PK08 0084","Fenster","Stück","2005-12-01","2099-12-31"]
["GPU PK08 0184","Fenster","Stück","2005-12-01","2099-12-31"]
["GPU PK08 0384","Fenster","Stück","2005-12-01","2099-12-31"]
["GPU PK10 0062","Fenster","Stück","2005-12-01","2099-12-31"]
["GPU PK10 0066","Fenster","Stück","2005-12-01","2099-12-31"]
["GPU PK10 0067","Fenster","Stück","2005-12-01","2099-12-31"]
["GPU PK10 0068","Fenster","Stück","2005-12-01","2099-12-31"]
["GPU PK10 0069","Fenster","Stück","2005-12-01","2099-12-31"]
["GPU PK10 0070","Fenster","Stück","2005-12-01","2099-12-31"]
["GPU PK10 0084","Fenster","Stück","2005-12-01","2099-12-31"]
["GPU PK10 0184","Fenster","Stück","2005-12-01","2099-12-31"]
["GPU PK10 0384","Fenster","Stück","2005-12-01","2099-12-31"]
["GPU SK06 0062","Fenster","Stück","2005-12-01","2099-12-31"]
["GPU SK06 0066","Fenster","Stück","2005-12-01","2099-12-31"]
["GPU SK06 006621","Fenster","Stück","2005-12-01","2099-12-31"]
["GPU SK06 0067","Fenster","Stück","2005-12-01","2099-12-31"]
["GPU SK06 0068","Fenster","Stück","2005-12-01","2099-12-31"]
["GPU SK06 0069","Fenster","Stück","2005-12-01","2099-12-31"]
["GPU SK06 0070","Fenster","Stück","2005-12-01","2099-12-31"]
["GPU SK06 007021","Fenster","Stück","2005-12-01","2099-12-31"]
["GPU SK06 0084","Fenster","Stück","2005-12-01","2099-12-31"]
["GPU SK06 0184","Fenster","Stück","2005-12-01","2099-12-31"]
["GPU SK06 0384","Fenster","Stück","2005-12-01","2099-12-31"]
["GPU SK08 0062","Fenster","Stück","2005-12-01","2099-12-31"]
["GPU SK08 0066","Fenster","Stück","2005-12-01","2099-12-31"]
["GPU SK08 006621","Fenster","Stück","2005-12-01","2099-12-31"]
["GPU SK08 0067","Fenster","Stück","2005-12-01","2099-12-31"]
["GPU SK08 0068","Fenster","Stück","2005-12-01","2099-12-31"]
["GPU SK08 0069","Fenster","Stück","2005-12-01","2099-12-31"]
["GPU SK08 0070","Fenster","Stück","2005-12-01","2099-12-31"]
["GPU SK08 007021","Fenster","Stück","2005-12-01","2099-12-31"]
["GPU SK08 0084","Fenster","Stück","2005-12-01","2099-12-31"]
["GPU SK08 0184","Fenster","Stück","2005-12-01","2099-12-31"]
["GPU SK08 0384","Fenster","Stück","2005-12-01","2099-12-31"]
["GPU SK10 0066","Fenster","Stück","2005-12-01","2099-12-31"]
["GPU SK10 0067","Fenster","Stück","2005-12-01","2099-12-31"]
["GPU SK10 0068","Fenster","Stück","2005-12-01","2099-12-31"]
["GPU SK10 0069","Fenster","Stück","2005-12-01","2099-12-31"]
["GPU SK10 0070","Fenster","Stück","2005-12-01","2099-12-31"]
["GPU SK10 0084","Fenster","Stück","2005-12-01","2099-12-31"]
["GPU SK10 0184","Fenster","Stück","2005-12-01","2099-12-31"]
["GPU SK10 0384","Fenster","Stück","2005-12-01","2099-12-31"]
["GPU UK08 0066","Fenster","Stück","2005-12-01","2099-12-31"]
["GPU UK08 0067","Fenster","Stück","2005-12-01","2099-12-31"]
["GPU UK08 0068","Fenster","Stück","2005-12-01","2099-12-31"]
["GPU UK08 0069","Fenster","Stück","2005-12-01","2099-12-31"]
["GPU UK08 0070","Fenster","Stück","2005-12-01","2099-12-31"]
["GPU UK08 0084","Fenster","Stück","2005-12-01","2099-12-31"]
["GPU UK08 0184","Fenster","Stück","2005-12-01","2099-12-31"]
["GPU UK08 0384","Fenster","Stück","2005-12-01","2099-12-31"]
["GTL MK08 2066","Fenster","Stück","2005-12-01","2099-12-31"]
["GTL MK08 2070","Fenster","Stück","2005-12-01","2099-12-31"]
["GTL MK08 3066","Fenster","Stück","2005-12-01","2099-12-31"]
["GTL MK08 3070","Fenster","Stück","2005-12-01","2099-12-31"]
["GTL SK08 2066","Fenster","Stück","2005-12-01","2099-12-31"]
["GTL SK08 2070","Fenster","Stück","2005-12-01","2099-12-31"]
["GTL SK08 3066","Fenster","Stück","2005-12-01","2099-12-31"]
["GTL SK08 3070","Fenster","Stück","2005-12-01","2099-12-31"]
["GTU MK08 0066","Fenster","Stück","2005-12-01","2099-12-31"]
["GTU MK08 0070","Fenster","Stück","2005-12-01","2099-12-31"]
["GTU SK08 0066","Fenster","Stück","2005-12-01","2099-12-31"]
["GTU SK08 0070","Fenster","Stück","2005-12-01","2099-12-31"]
["GTU SK10 0066L","Fenster","Stück","2005-12-01","2099-12-31"]
["GTU SK10 0070","Fenster","Stück","2005-12-01","2099-12-31"]
["GVK 0000Z","Fenster","Stück","2005-12-01","2099-12-31"]
["GVT 103 0059Z","Fenster","Stück","2005-12-01","2099-12-31"]
["GVT 103 7759Z","Fenster","Stück","2005-12-01","2099-12-31"]
["GXL FK06 2066","Fenster","Stück","2005-12-01","2099-12-31"]
["GXL FK06 2070","Fenster","Stück","2005-12-01","2099-12-31"]
["GXL FK06 3066","Fenster","Stück","2005-12-01","2099-12-31"]
["GXL FK06 3070","Fenster","Stück","2005-12-01","2099-12-31"]
["GXLA FK06 2066","Fenster","Stück","2005-12-01","2099-12-31"]
["GXLA FK06 2070","Fenster","Stück","2005-12-01","2099-12-31"]
["GXLA FK06 2166","Fenster","Stück","2005-12-01","2099-12-31"]
["GXLA FK06 2170","Fenster","Stück","2005-12-01","2099-12-31"]
["GXLA FK06 2366","Fenster","Stück","2005-12-01","2099-12-31"]
["GXLA FK06 2370","Fenster","Stück","2005-12-01","2099-12-31"]
["GXLA FK06 3066","Fenster","Stück","2005-12-01","2099-12-31"]
["GXLA FK06 3070","Fenster","Stück","2005-12-01","2099-12-31"]
["GXLA FK06 3166","Fenster","Stück","2005-12-01","2099-12-31"]
["GXLA FK06 3170","Fenster","Stück","2005-12-01","2099-12-31"]
["GXLA FK06 3366","Fenster","Stück","2005-12-01","2099-12-31"]
["GXLA FK06 3370","Fenster","Stück","2005-12-01","2099-12-31"]
["GXLB FK06 2066","Fenster","Stück","2005-12-01","2099-12-31"]
["GXLB FK06 2070","Fenster","Stück","2005-12-01","2099-12-31"]
["GXLB FK06 2166","Fenster","Stück","2005-12-01","2099-12-31"]
["GXLB FK06 2170","Fenster","Stück","2005-12-01","2099-12-31"]
["GXLB FK06 2366","Fenster","Stück","2005-12-01","2099-12-31"]
["GXLB FK06 2370","Fenster","Stück","2005-12-01","2099-12-31"]
["GXLB FK06 3066","Fenster","Stück","2005-12-01","2099-12-31"]
["GXLB FK06 3070","Fenster","Stück","2005-12-01","2099-12-31"]
["GXLB FK06 3166","Fenster","Stück","2005-12-01","2099-12-31"]
["GXLB FK06 3170","Fenster","Stück","2005-12-01","2099-12-31"]
["GXLB FK06 3366","Fenster","Stück","2005-12-01","2099-12-31"]
["GXLB FK06 3370","Fenster","Stück","2005-12-01","2099-12-31"]
["GXU CK04 0066","Fenster","Stück","2005-12-01","2099-12-31"]
["GXU CK04 0070","Fenster","Stück","2005-12-01","2099-12-31"]
["GXU CK06 0066","Fenster","Stück","2005-12-01","2099-12-31"]
["GXU CK06 0070","Fenster","Stück","2005-12-01","2099-12-31"]
["GXU FK06 0066","Fenster","Stück","2005-12-01","2099-12-31"]
["GXU FK06 0070","Fenster","Stück","2005-12-01","2099-12-31"]
["TCR 0K14 0010P1","Fenster","Stück","2005-12-01","2099-12-31"]
["TCR 0K14 0010P2","Fenster","Stück","2005-12-01","2099-12-31"]
["TLR 0K10 2010","Fenster","Stück","2005-12-01","2099-12-31"]
["TLR 0K14 2010","Fenster","Stück","2005-12-01","2099-12-31"]
["TWR 0K10 2010","Fenster","Stück","2005-12-01","2099-12-31"]
["TWR 0K14 2010","Fenster","Stück","2005-12-01","2099-12-31"]
["VEA M35 2065","Fenster","Stück","2005-12-01","2099-12-31"]
["VEA M35 3065","Fenster","Stück","2005-12-01","2099-12-31"]
["VEB M35 2065","Fenster","Stück","2005-12-01","2099-12-31"]
["VEB M35 3065","Fenster","Stück","2005-12-01","2099-12-31"]
["VEC M35 2065","Fenster","Stück","2005-12-01","2099-12-31"]
["VEC M35 3065","Fenster","Stück","2005-12-01","2099-12-31"]
["VFA MK35 2066","Fenster","Stück","2005-12-01","2099-12-31"]
["VFA MK35 2068","Fenster","Stück","2005-12-01","2099-12-31"]
["VFA MK35 2070","Fenster","Stück","2005-12-01","2099-12-31"]
["VFA MK35 2084","Fenster","Stück","2005-12-01","2099-12-31"]
["VFA MK35 3066","Fenster","Stück","2005-12-01","2099-12-31"]
["VFA MK35 3068","Fenster","Stück","2005-12-01","2099-12-31"]
["VFA MK35 3070","Fenster","Stück","2005-12-01","2099-12-31"]
["VFA MK35 3084","Fenster","Stück","2005-12-01","2099-12-31"]
["VFA MK36 2066","Fenster","Stück","2005-12-01","2099-12-31"]
["VFA MK36 2068","Fenster","Stück","2005-12-01","2099-12-31"]
["VFA MK36 2070","Fenster","Stück","2005-12-01","2099-12-31"]
["VFA MK36 2084","Fenster","Stück","2005-12-01","2099-12-31"]
["VFA MK36 3066","Fenster","Stück","2005-12-01","2099-12-31"]
["VFA MK36 3068","Fenster","Stück","2005-12-01","2099-12-31"]
["VFA MK36 3070","Fenster","Stück","2005-12-01","2099-12-31"]
["VFA MK36 3084","Fenster","Stück","2005-12-01","2099-12-31"]
["VFA MK38 2066","Fenster","Stück","2005-12-01","2099-12-31"]
["VFA MK38 2068","Fenster","Stück","2005-12-01","2099-12-31"]
["VFA MK38 2070","Fenster","Stück","2005-12-01","2099-12-31"]
["VFA MK38 2084","Fenster","Stück","2005-12-01","2099-12-31"]
["VFA MK38 3066","Fenster","Stück","2005-12-01","2099-12-31"]
["VFA MK38 3068","Fenster","Stück","2005-12-01","2099-12-31"]
["VFA MK38 3070","Fenster","Stück","2005-12-01","2099-12-31"]
["VFA MK38 3084","Fenster","Stück","2005-12-01","2099-12-31"]
["VFA PK35 2066","Fenster","Stück","2005-12-01","2099-12-31"]
["VFA PK35 2068","Fenster","Stück","2005-12-01","2099-12-31"]
["VFA PK35 2070","Fenster","Stück","2005-12-01","2099-12-31"]
["VFA PK35 2084","Fenster","Stück","2005-12-01","2099-12-31"]
["VFA PK35 3066","Fenster","Stück","2005-12-01","2099-12-31"]
["VFA PK35 3068","Fenster","Stück","2005-12-01","2099-12-31"]
["VFA PK35 3070","Fenster","Stück","2005-12-01","2099-12-31"]
["VFA PK35 3084","Fenster","Stück","2005-12-01","2099-12-31"]
["VFA PK36 2066","Fenster","Stück","2005-12-01","2099-12-31"]
["VFA PK36 2068","Fenster","Stück","2005-12-01","2099-12-31"]
["VFA PK36 2070","Fenster","Stück","2005-12-01","2099-12-31"]
["VFA PK36 2084","Fenster","Stück","2005-12-01","2099-12-31"]
["VFA PK36 3066","Fenster","Stück","2005-12-01","2099-12-31"]
["VFA PK36 3068","Fenster","Stück","2005-12-01","2099-12-31"]
["VFA PK36 3070","Fenster","Stück","2005-12-01","2099-12-31"]
["VFA PK36 3084","Fenster","Stück","2005-12-01","2099-12-31"]
["VFA PK38 2066","Fenster","Stück","2005-12-01","2099-12-31"]
["VFA PK38 2068","Fenster","Stück","2005-12-01","2099-12-31"]
["VFA PK38 2070","Fenster","Stück","2005-12-01","2099-12-31"]
["VFA PK38 2084","Fenster","Stück","2005-12-01","2099-12-31"]
["VFA PK38 3066","Fenster","Stück","2005-12-01","2099-12-31"]
["VFA PK38 3068","Fenster","Stück","2005-12-01","2099-12-31"]
["VFA PK38 3070","Fenster","Stück","2005-12-01","2099-12-31"]
["VFA PK38 3084","Fenster","Stück","2005-12-01","2099-12-31"]
["VFA SK35 2066","Fenster","Stück","2005-12-01","2099-12-31"]
["VFA SK35 2068","Fenster","Stück","2005-12-01","2099-12-31"]
["VFA SK35 2070","Fenster","Stück","2005-12-01","2099-12-31"]
["VFA SK35 2084","Fenster","Stück","2005-12-01","2099-12-31"]
["VFA SK35 3066","Fenster","Stück","2005-12-01","2099-12-31"]
["VFA SK35 3068","Fenster","Stück","2005-12-01","2099-12-31"]
["VFA SK35 3070","Fenster","Stück","2005-12-01","2099-12-31"]
["VFA SK35 3084","Fenster","Stück","2005-12-01","2099-12-31"]
["VFA SK36 2066","Fenster","Stück","2005-12-01","2099-12-31"]
["VFA SK36 2068","Fenster","Stück","2005-12-01","2099-12-31"]
["VFA SK36 2070","Fenster","Stück","2005-12-01","2099-12-31"]
["VFA SK36 2084","Fenster","Stück","2005-12-01","2099-12-31"]
["VFA SK36 3066","Fenster","Stück","2005-12-01","2099-12-31"]
["VFA SK36 3068","Fenster","Stück","2005-12-01","2099-12-31"]
["VFA SK36 3070","Fenster","Stück","2005-12-01","2099-12-31"]
["VFA SK36 3084","Fenster","Stück","2005-12-01","2099-12-31"]
["VFA SK38 2066","Fenster","Stück","2005-12-01","2099-12-31"]
["VFA SK38 2068","Fenster","Stück","2005-12-01","2099-12-31"]
["VFA SK38 2070","Fenster","Stück","2005-12-01","2099-12-31"]
["VFA SK38 2084","Fenster","Stück","2005-12-01","2099-12-31"]
["VFA SK38 3066","Fenster","Stück","2005-12-01","2099-12-31"]
["VFA SK38 3068","Fenster","Stück","2005-12-01","2099-12-31"]
["VFA SK38 3070","Fenster","Stück","2005-12-01","2099-12-31"]
["VFA SK38 3084","Fenster","Stück","2005-12-01","2099-12-31"]
["VFB MK35 2066","Fenster","Stück","2005-12-01","2099-12-31"]
["VFB MK35 2068","Fenster","Stück","2005-12-01","2099-12-31"]
["VFB MK35 2070","Fenster","Stück","2005-12-01","2099-12-31"]
["VFB MK35 2084","Fenster","Stück","2005-12-01","2099-12-31"]
["VFB MK35 3066","Fenster","Stück","2005-12-01","2099-12-31"]
["VFB MK35 3068","Fenster","Stück","2005-12-01","2099-12-31"]
["VFB MK35 3070","Fenster","Stück","2005-12-01","2099-12-31"]
["VFB MK35 3084","Fenster","Stück","2005-12-01","2099-12-31"]
["VFB MK36 2066","Fenster","Stück","2005-12-01","2099-12-31"]
["VFB MK36 2068","Fenster","Stück","2005-12-01","2099-12-31"]
["VFB MK36 2070","Fenster","Stück","2005-12-01","2099-12-31"]
["VFB MK36 2084","Fenster","Stück","2005-12-01","2099-12-31"]
["VFB MK36 3066","Fenster","Stück","2005-12-01","2099-12-31"]
["VFB MK36 3068","Fenster","Stück","2005-12-01","2099-12-31"]
["VFB MK36 3070","Fenster","Stück","2005-12-01","2099-12-31"]
["VFB MK36 3084","Fenster","Stück","2005-12-01","2099-12-31"]
["VFB MK38 2066","Fenster","Stück","2005-12-01","2099-12-31"]
["VFB MK38 2068","Fenster","Stück","2005-12-01","2099-12-31"]
["VFB MK38 2070","Fenster","Stück","2005-12-01","2099-12-31"]
["VFB MK38 2084","Fenster","Stück","2005-12-01","2099-12-31"]
["VFB MK38 3066","Fenster","Stück","2005-12-01","2099-12-31"]
["VFB MK38 3068","Fenster","Stück","2005-12-01","2099-12-31"]
["VFB MK38 3070","Fenster","Stück","2005-12-01","2099-12-31"]
["VFB MK38 3084","Fenster","Stück","2005-12-01","2099-12-31"]
["VFB PK35 2066","Fenster","Stück","2005-12-01","2099-12-31"]
["VFB PK35 2068","Fenster","Stück","2005-12-01","2099-12-31"]
["VFB PK35 2070","Fenster","Stück","2005-12-01","2099-12-31"]
["VFB PK35 2084","Fenster","Stück","2005-12-01","2099-12-31"]
["VFB PK35 3066","Fenster","Stück","2005-12-01","2099-12-31"]
["VFB PK35 3068","Fenster","Stück","2005-12-01","2099-12-31"]
["VFB PK35 3070","Fenster","Stück","2005-12-01","2099-12-31"]
["VFB PK35 3084","Fenster","Stück","2005-12-01","2099-12-31"]
["VFB PK36 2066","Fenster","Stück","2005-12-01","2099-12-31"]
["VFB PK36 2068","Fenster","Stück","2005-12-01","2099-12-31"]
["VFB PK36 2070","Fenster","Stück","2005-12-01","2099-12-31"]
["VFB PK36 2084","Fenster","Stück","2005-12-01","2099-12-31"]
["VFB PK36 3066","Fenster","Stück","2005-12-01","2099-12-31"]
["VFB PK36 3068","Fenster","Stück","2005-12-01","2099-12-31"]
["VFB PK36 3070","Fenster","Stück","2005-12-01","2099-12-31"]
["VFB PK36 3084","Fenster","Stück","2005-12-01","2099-12-31"]
["VFB PK38 2066","Fenster","Stück","2005-12-01","2099-12-31"]
["VFB PK38 2068","Fenster","Stück","2005-12-01","2099-12-31"]
["VFB PK38 2070","Fenster","Stück","2005-12-01","2099-12-31"]
["VFB PK38 2084","Fenster","Stück","2005-12-01","2099-12-31"]
["VFB PK38 3066","Fenster","Stück","2005-12-01","2099-12-31"]
["VFB PK38 3068","Fenster","Stück","2005-12-01","2099-12-31"]
["VFB PK38 3070","Fenster","Stück","2005-12-01","2099-12-31"]
["VFB PK38 3084","Fenster","Stück","2005-12-01","2099-12-31"]
["VFB SK35 2066","Fenster","Stück","2005-12-01","2099-12-31"]
["VFB SK35 2068","Fenster","Stück","2005-12-01","2099-12-31"]
["VFB SK35 2070","Fenster","Stück","2005-12-01","2099-12-31"]
["VFB SK35 2084","Fenster","Stück","2005-12-01","2099-12-31"]
["VFB SK35 3066","Fenster","Stück","2005-12-01","2099-12-31"]
["VFB SK35 3068","Fenster","Stück","2005-12-01","2099-12-31"]
["VFB SK35 3070","Fenster","Stück","2005-12-01","2099-12-31"]
["VFB SK35 3084","Fenster","Stück","2005-12-01","2099-12-31"]
["VFB SK36 2066","Fenster","Stück","2005-12-01","2099-12-31"]
["VFB SK36 2068","Fenster","Stück","2005-12-01","2099-12-31"]
["VFB SK36 2070","Fenster","Stück","2005-12-01","2099-12-31"]
["VFB SK36 2084","Fenster","Stück","2005-12-01","2099-12-31"]
["VFB SK36 3066","Fenster","Stück","2005-12-01","2099-12-31"]
["VFB SK36 3068","Fenster","Stück","2005-12-01","2099-12-31"]
["VFB SK36 3070","Fenster","Stück","2005-12-01","2099-12-31"]
["VFB SK36 3084","Fenster","Stück","2005-12-01","2099-12-31"]
["VFB SK38 2066","Fenster","Stück","2005-12-01","2099-12-31"]
["VFB SK38 2068","Fenster","Stück","2005-12-01","2099-12-31"]
["VFB SK38 2070","Fenster","Stück","2005-12-01","2099-12-31"]
["VFB SK38 2084","Fenster","Stück","2005-12-01","2099-12-31"]
["VFB SK38 3066","Fenster","Stück","2005-12-01","2099-12-31"]
["VFB SK38 3068","Fenster","Stück","2005-12-01","2099-12-31"]
["VFB SK38 3070","Fenster","Stück","2005-12-01","2099-12-31"]
["VFB SK38 3084","Fenster","Stück","2005-12-01","2099-12-31"]
["VFE MK31 2062","Fenster","Stück","2005-12-01","2099-12-31"]
["VFE MK31 2066","Fenster","Stück","2005-12-01","2099-12-31"]
["VFE MK31 2068","Fenster","Stück","2005-12-01","2099-12-31"]
["VFE MK31 2070","Fenster","Stück","2005-12-01","2099-12-31"]
["VFE MK31 2084","Fenster","Stück","2005-12-01","2099-12-31"]
["VFE MK31 2184","Fenster","Stück","2005-12-01","2099-12-31"]
["VFE MK31 2384","Fenster","Stück","2005-12-01","2099-12-31"]
["VFE MK31 3062","Fenster","Stück","2005-12-01","2099-12-31"]
["VFE MK31 3066","Fenster","Stück","2005-12-01","2099-12-31"]
["VFE MK31 3068","Fenster","Stück","2005-12-01","2099-12-31"]
["VFE MK31 3070","Fenster","Stück","2005-12-01","2099-12-31"]
["VFE MK31 3084","Fenster","Stück","2005-12-01","2099-12-31"]
["VFE MK31 3184","Fenster","Stück","2005-12-01","2099-12-31"]
["VFE MK31 3384","Fenster","Stück","2005-12-01","2099-12-31"]
["VFE MK35 2062","Fenster","Stück","2005-12-01","2099-12-31"]
["VFE MK35 2066","Fenster","Stück","2005-12-01","2099-12-31"]
["VFE MK35 2068","Fenster","Stück","2005-12-01","2099-12-31"]
["VFE MK35 2070","Fenster","Stück","2005-12-01","2099-12-31"]
["VFE MK35 2084","Fenster","Stück","2005-12-01","2099-12-31"]
["VFE MK35 2184","Fenster","Stück","2005-12-01","2099-12-31"]
["VFE MK35 2384","Fenster","Stück","2005-12-01","2099-12-31"]
["VFE MK35 3062","Fenster","Stück","2005-12-01","2099-12-31"]
["VFE MK35 3066","Fenster","Stück","2005-12-01","2099-12-31"]
["VFE MK35 3068","Fenster","Stück","2005-12-01","2099-12-31"]
["VFE MK35 3070","Fenster","Stück","2005-12-01","2099-12-31"]
["VFE MK35 3084","Fenster","Stück","2005-12-01","2099-12-31"]
["VFE MK35 3184","Fenster","Stück","2005-12-01","2099-12-31"]
["VFE MK35 3384","Fenster","Stück","2005-12-01","2099-12-31"]
["VFE MK36 2070","Fenster","Stück","2005-12-01","2099-12-31"]
["VFE MK36 2084","Fenster","Stück","2005-12-01","2099-12-31"]
["VFE MK36 3070","Fenster","Stück","2005-12-01","2099-12-31"]
["VFE MK36 3084","Fenster","Stück","2005-12-01","2099-12-31"]
["VFE MK38 2070","Fenster","Stück","2005-12-01","2099-12-31"]
["VFE MK38 2084","Fenster","Stück","2005-12-01","2099-12-31"]
["VFE MK38 3070","Fenster","Stück","2005-12-01","2099-12-31"]
["VFE MK38 3084","Fenster","Stück","2005-12-01","2099-12-31"]
["VFE PK31 2062","Fenster","Stück","2005-12-01","2099-12-31"]
["VFE PK31 2066","Fenster","Stück","2005-12-01","2099-12-31"]
["VFE PK31 2068","Fenster","Stück","2005-12-01","2099-12-31"]
["VFE PK31 2070","Fenster","Stück","2005-12-01","2099-12-31"]
["VFE PK31 2084","Fenster","Stück","2005-12-01","2099-12-31"]
["VFE PK31 2184","Fenster","Stück","2005-12-01","2099-12-31"]
["VFE PK31 2384","Fenster","Stück","2005-12-01","2099-12-31"]
["VFE PK31 3062","Fenster","Stück","2005-12-01","2099-12-31"]
["VFE PK31 3066","Fenster","Stück","2005-12-01","2099-12-31"]
["VFE PK31 3068","Fenster","Stück","2005-12-01","2099-12-31"]
["VFE PK31 3070","Fenster","Stück","2005-12-01","2099-12-31"]
["VFE PK31 3084","Fenster","Stück","2005-12-01","2099-12-31"]
["VFE PK31 3184","Fenster","Stück","2005-12-01","2099-12-31"]
["VFE PK31 3384","Fenster","Stück","2005-12-01","2099-12-31"]
["VFE PK35 2062","Fenster","Stück","2005-12-01","2099-12-31"]
["VFE PK35 2066","Fenster","Stück","2005-12-01","2099-12-31"]
["VFE PK35 2068","Fenster","Stück","2005-12-01","2099-12-31"]
["VFE PK35 2070","Fenster","Stück","2005-12-01","2099-12-31"]
["VFE PK35 2084","Fenster","Stück","2005-12-01","2099-12-31"]
["VFE PK35 2184","Fenster","Stück","2005-12-01","2099-12-31"]
["VFE PK35 2384","Fenster","Stück","2005-12-01","2099-12-31"]
["VFE PK35 3062","Fenster","Stück","2005-12-01","2099-12-31"]
["VFE PK35 3066","Fenster","Stück","2005-12-01","2099-12-31"]
["VFE PK35 3068","Fenster","Stück","2005-12-01","2099-12-31"]
["VFE PK35 3070","Fenster","Stück","2005-12-01","2099-12-31"]
["VFE PK35 3084","Fenster","Stück","2005-12-01","2099-12-31"]
["VFE PK35 3184","Fenster","Stück","2005-12-01","2099-12-31"]
["VFE PK35 3384","Fenster","Stück","2005-12-01","2099-12-31"]
["VFE PK36 2070","Fenster","Stück","2005-12-01","2099-12-31"]
["VFE PK36 2084","Fenster","Stück","2005-12-01","2099-12-31"]
["VFE PK36 3070","Fenster","Stück","2005-12-01","2099-12-31"]
["VFE PK36 3084","Fenster","Stück","2005-12-01","2099-12-31"]
["VFE PK38 2070","Fenster","Stück","2005-12-01","2099-12-31"]
["VFE PK38 2084","Fenster","Stück","2005-12-01","2099-12-31"]
["VFE PK38 3070","Fenster","Stück","2005-12-01","2099-12-31"]
["VFE PK38 3084","Fenster","Stück","2005-12-01","2099-12-31"]
["VFE SK31 2062","Fenster","Stück","2005-12-01","2099-12-31"]
["VFE SK31 2066","Fenster","Stück","2005-12-01","2099-12-31"]
["VFE SK31 2068","Fenster","Stück","2005-12-01","2099-12-31"]
["VFE SK31 2070","Fenster","Stück","2005-12-01","2099-12-31"]
["VFE SK31 2084","Fenster","Stück","2005-12-01","2099-12-31"]
["VFE SK31 2184","Fenster","Stück","2005-12-01","2099-12-31"]
["VFE SK31 2384","Fenster","Stück","2005-12-01","2099-12-31"]
["VFE SK31 3062","Fenster","Stück","2005-12-01","2099-12-31"]
["VFE SK31 3066","Fenster","Stück","2005-12-01","2099-12-31"]
["VFE SK31 3068","Fenster","Stück","2005-12-01","2099-12-31"]
["VFE SK31 3070","Fenster","Stück","2005-12-01","2099-12-31"]
["VFE SK31 3084","Fenster","Stück","2005-12-01","2099-12-31"]
["VFE SK31 3184","Fenster","Stück","2005-12-01","2099-12-31"]
["VFE SK31 3384","Fenster","Stück","2005-12-01","2099-12-31"]
["VFE SK35 2062","Fenster","Stück","2005-12-01","2099-12-31"]
["VFE SK35 2066","Fenster","Stück","2005-12-01","2099-12-31"]
["VFE SK35 2068","Fenster","Stück","2005-12-01","2099-12-31"]
["VFE SK35 2070","Fenster","Stück","2005-12-01","2099-12-31"]
["VFE SK35 2084","Fenster","Stück","2005-12-01","2099-12-31"]
["VFE SK35 2184","Fenster","Stück","2005-12-01","2099-12-31"]
["VFE SK35 2384","Fenster","Stück","2005-12-01","2099-12-31"]
["VFE SK35 3062","Fenster","Stück","2005-12-01","2099-12-31"]
["VFE SK35 3066","Fenster","Stück","2005-12-01","2099-12-31"]
["VFE SK35 3068","Fenster","Stück","2005-12-01","2099-12-31"]
["VFE SK35 3070","Fenster","Stück","2005-12-01","2099-12-31"]
["VFE SK35 3084","Fenster","Stück","2005-12-01","2099-12-31"]
["VFE SK35 3184","Fenster","Stück","2005-12-01","2099-12-31"]
["VFE SK35 3384","Fenster","Stück","2005-12-01","2099-12-31"]
["VFE SK36 2070","Fenster","Stück","2005-12-01","2099-12-31"]
["VFE SK36 2084","Fenster","Stück","2005-12-01","2099-12-31"]
["VFE SK36 3070","Fenster","Stück","2005-12-01","2099-12-31"]
["VFE SK36 3084","Fenster","Stück","2005-12-01","2099-12-31"]
["VFE SK38 2070","Fenster","Stück","2005-12-01","2099-12-31"]
["VFE SK38 2084","Fenster","Stück","2005-12-01","2099-12-31"]
["VFE SK38 3070","Fenster","Stück","2005-12-01","2099-12-31"]
["VFE SK38 3084","Fenster","Stück","2005-12-01","2099-12-31"]
["VFE UK31 2062","Fenster","Stück","2005-12-01","2099-12-31"]
["VFE UK31 2066","Fenster","Stück","2005-12-01","2099-12-31"]
["VFE UK31 2068","Fenster","Stück","2005-12-01","2099-12-31"]
["VFE UK31 2070","Fenster","Stück","2005-12-01","2099-12-31"]
["VFE UK31 2084","Fenster","Stück","2005-12-01","2099-12-31"]
["VFE UK31 2184","Fenster","Stück","2005-12-01","2099-12-31"]
["VFE UK31 2384","Fenster","Stück","2005-12-01","2099-12-31"]
["VFE UK31 3062","Fenster","Stück","2005-12-01","2099-12-31"]
["VFE UK31 3066","Fenster","Stück","2005-12-01","2099-12-31"]
["VFE UK31 3068","Fenster","Stück","2005-12-01","2099-12-31"]
["VFE UK31 3070","Fenster","Stück","2005-12-01","2099-12-31"]
["VFE UK31 3084","Fenster","Stück","2005-12-01","2099-12-31"]
["VFE UK31 3184","Fenster","Stück","2005-12-01","2099-12-31"]
["VFE UK31 3384","Fenster","Stück","2005-12-01","2099-12-31"]
["VFE UK35 2062","Fenster","Stück","2005-12-01","2099-12-31"]
["VFE UK35 2066","Fenster","Stück","2005-12-01","2099-12-31"]
["VFE UK35 2068","Fenster","Stück","2005-12-01","2099-12-31"]
["VFE UK35 2070","Fenster","Stück","2005-12-01","2099-12-31"]
["VFE UK35 2084","Fenster","Stück","2005-12-01","2099-12-31"]
["VFE UK35 2184","Fenster","Stück","2005-12-01","2099-12-31"]
["VFE UK35 2384","Fenster","Stück","2005-12-01","2099-12-31"]
["VFE UK35 3062","Fenster","Stück","2005-12-01","2099-12-31"]
["VFE UK35 3066","Fenster","Stück","2005-12-01","2099-12-31"]
["VFE UK35 3068","Fenster","Stück","2005-12-01","2099-12-31"]
["VFE UK35 3070","Fenster","Stück","2005-12-01","2099-12-31"]
["VFE UK35 3084","Fenster","Stück","2005-12-01","2099-12-31"]
["VFE UK35 3184","Fenster","Stück","2005-12-01","2099-12-31"]
["VFE UK35 3384","Fenster","Stück","2005-12-01","2099-12-31"]
["VFE UK36 2070","Fenster","Stück","2005-12-01","2099-12-31"]
["VFE UK36 2084","Fenster","Stück","2005-12-01","2099-12-31"]
["VFE UK36 3070","Fenster","Stück","2005-12-01","2099-12-31"]
["VFE UK36 3084","Fenster","Stück","2005-12-01","2099-12-31"]
["VFE UK38 2070","Fenster","Stück","2005-12-01","2099-12-31"]
["VFE UK38 2084","Fenster","Stück","2005-12-01","2099-12-31"]
["VFE UK38 3070","Fenster","Stück","2005-12-01","2099-12-31"]
["VFE UK38 3084","Fenster","Stück","2005-12-01","2099-12-31"]
["VIU MK31 0062","Fenster","Stück","2005-12-01","2099-12-31"]
["VIU MK31 0066","Fenster","Stück","2005-12-01","2099-12-31"]
["VIU MK31 0068","Fenster","Stück","2005-12-01","2099-12-31"]
["VIU MK31 0070","Fenster","Stück","2005-12-01","2099-12-31"]
["VIU MK31 0084","Fenster","Stück","2005-12-01","2099-12-31"]
["VIU MK31 0184","Fenster","Stück","2005-12-01","2099-12-31"]
["VIU MK35 0062","Fenster","Stück","2005-12-01","2099-12-31"]
["VIU MK35 0066","Fenster","Stück","2005-12-01","2099-12-31"]
["VIU MK35 0068","Fenster","Stück","2005-12-01","2099-12-31"]
["VIU MK35 0070","Fenster","Stück","2005-12-01","2099-12-31"]
["VIU MK35 0084","Fenster","Stück","2005-12-01","2099-12-31"]
["VIU MK35 0184","Fenster","Stück","2005-12-01","2099-12-31"]
["VIU MK36 0070","Fenster","Stück","2005-12-01","2099-12-31"]
["VIU MK36 0084","Fenster","Stück","2005-12-01","2099-12-31"]
["VIU MK38 0070","Fenster","Stück","2005-12-01","2099-12-31"]
["VIU MK38 0084","Fenster","Stück","2005-12-01","2099-12-31"]
["VIU PK31 0062","Fenster","Stück","2005-12-01","2099-12-31"]
["VIU PK31 0066","Fenster","Stück","2005-12-01","2099-12-31"]
["VIU PK31 0068","Fenster","Stück","2005-12-01","2099-12-31"]
["VIU PK31 0070","Fenster","Stück","2005-12-01","2099-12-31"]
["VIU PK31 0084","Fenster","Stück","2005-12-01","2099-12-31"]
["VIU PK31 0184","Fenster","Stück","2005-12-01","2099-12-31"]
["VIU PK35 0062","Fenster","Stück","2005-12-01","2099-12-31"]
["VIU PK35 0066","Fenster","Stück","2005-12-01","2099-12-31"]
["VIU PK35 0068","Fenster","Stück","2005-12-01","2099-12-31"]
["VIU PK35 0070","Fenster","Stück","2005-12-01","2099-12-31"]
["VIU PK35 0084","Fenster","Stück","2005-12-01","2099-12-31"]
["VIU PK35 0184","Fenster","Stück","2005-12-01","2099-12-31"]
["VIU PK36 0070","Fenster","Stück","2005-12-01","2099-12-31"]
["VIU PK36 0084","Fenster","Stück","2005-12-01","2099-12-31"]
["VIU PK38 0070","Fenster","Stück","2005-12-01","2099-12-31"]
["VIU PK38 0084","Fenster","Stück","2005-12-01","2099-12-31"]
["VIU SK31 0062","Fenster","Stück","2005-12-01","2099-12-31"]
["VIU SK31 0066","Fenster","Stück","2005-12-01","2099-12-31"]
["VIU SK31 0068","Fenster","Stück","2005-12-01","2099-12-31"]
["VIU SK31 0070","Fenster","Stück","2005-12-01","2099-12-31"]
["VIU SK31 0084","Fenster","Stück","2005-12-01","2099-12-31"]
["VIU SK31 0184","Fenster","Stück","2005-12-01","2099-12-31"]
["VIU SK35 0062","Fenster","Stück","2005-12-01","2099-12-31"]
["VIU SK35 0066","Fenster","Stück","2005-12-01","2099-12-31"]
["VIU SK35 0068","Fenster","Stück","2005-12-01","2099-12-31"]
["VIU SK35 0070","Fenster","Stück","2005-12-01","2099-12-31"]
["VIU SK35 0084","Fenster","Stück","2005-12-01","2099-12-31"]
["VIU SK35 0184","Fenster","Stück","2005-12-01","2099-12-31"]
["VIU SK36 0070","Fenster","Stück","2005-12-01","2099-12-31"]
["VIU SK36 0084","Fenster","Stück","2005-12-01","2099-12-31"]
["VIU SK38 0070","Fenster","Stück","2005-12-01","2099-12-31"]
["VIU SK38 0084","Fenster","Stück","2005-12-01","2099-12-31"]
["VIU UK31 0062","Fenster","Stück","2005-12-01","2099-12-31"]
["VIU UK31 0066","Fenster","Stück","2005-12-01","2099-12-31"]
["VIU UK31 0068","Fenster","Stück","2005-12-01","2099-12-31"]
["VIU UK31 0070","Fenster","Stück","2005-12-01","2099-12-31"]
["VIU UK31 0084","Fenster","Stück","2005-12-01","2099-12-31"]
["VIU UK31 0184","Fenster","Stück","2005-12-01","2099-12-31"]
["VIU UK35 0062","Fenster","Stück","2005-12-01","2099-12-31"]
["VIU UK35 0066","Fenster","Stück","2005-12-01","2099-12-31"]
["VIU UK35 0068","Fenster","Stück","2005-12-01","2099-12-31"]
["VIU UK35 0070","Fenster","Stück","2005-12-01","2099-12-31"]
["VIU UK35 0084","Fenster","Stück","2005-12-01","2099-12-31"]
["VIU UK35 0184","Fenster","Stück","2005-12-01","2099-12-31"]
["VIU UK36 0070","Fenster","Stück","2005-12-01","2099-12-31"]
["VIU UK36 0084","Fenster","Stück","2005-12-01","2099-12-31"]
["VIU UK38 0070","Fenster","Stück","2005-12-01","2099-12-31"]
["VIU UK38 0084","Fenster","Stück","2005-12-01","2099-12-31"]
["VKU 0811 0081","Fenster","Stück","2005-12-01","2099-12-31"]
["VKU 1011 0081","Fenster","Stück","2005-12-01","2099-12-31"]
["VKU 1014 0081","Fenster","Stück","2005-12-01","2099-12-31"]
["VKU Y33 0081","Fenster","Stück","2005-12-01","2099-12-31"]
["VKU Y35 0081","Fenster","Stück","2005-12-01","2099-12-31"]
["VKU Y43 0081","Fenster","Stück","2005-12-01","2099-12-31"]
["VKU Y45 0081","Fenster","Stück","2005-12-01","2099-12-31"]
["VKU Y47 0081","Fenster","Stück","2005-12-01","2099-12-31"]
["VKU Y65 0081","Fenster","Stück","2005-12-01","2099-12-31"]
["VKU Y67 0081","Fenster","Stück","2005-12-01","2099-12-31"]
["VKU Y85 0081","Fenster","Stück","2005-12-01","2099-12-31"]
["VKU Y87 0081","Fenster","Stück","2005-12-01","2099-12-31"]
["VKU Y97 0081","Fenster","Stück","2005-12-01","2099-12-31"]
["VU Y21 0081","Fenster","Stück","2005-12-01","2099-12-31"]
["VU Y23 0081","Fenster","Stück","2005-12-01","2099-12-31"]
["VU Y33 0081","Fenster","Stück","2005-12-01","2099-12-31"]
["VU Y35 0081","Fenster","Stück","2005-12-01","2099-12-31"]
["VU Y43 0081","Fenster","Stück","2005-12-01","2099-12-31"]
["VU Y45 0081","Fenster","Stück","2005-12-01","2099-12-31"]
["VU Y47 0081","Fenster","Stück","2005-12-01","2099-12-31"]
["VU Y65 0081","Fenster","Stück","2005-12-01","2099-12-31"]
["VU Y67 0081","Fenster","Stück","2005-12-01","2099-12-31"]
["VU Y85 0081","Fenster","Stück","2005-12-01","2099-12-31"]
["VU Y87 0081","Fenster","Stück","2005-12-01","2099-12-31"]
["VU Y89 0081","Fenster","Stück","2005-12-01","2099-12-31"]
["VU Y97 0081","Fenster","Stück","2005-12-01","2099-12-31"]
["VU Y99 0081","Fenster","Stück","2005-12-01","2099-12-31"]
["Sonderausführungen Gesamt","Fenster","Stück","2005-12-01","2099-12-31"]

{"sheet":"Material2","index":6,"n_rows":317,"n_cols":6,"rows_kept":317,"cut":false,"hidden":true,"merged":[]}
["Material","MatType","UM","ValidFrom","ValidTo","Remark"]
[0,null,null,null,null,"Do not delete this line"]
["a",null,null,null,null,"Do not delete this line"]
["SMG FK04 0000S","Rollläden","Stück","2005-12-01","2099-12-31"]
["SMG FK04 0700S","Rollläden","Stück","2005-12-01","2099-12-31"]
["SMG FK06 0000S","Rollläden","Stück","2005-12-01","2099-12-31"]
["SMG FK06 0700S","Rollläden","Stück","2005-12-01","2099-12-31"]
["SMG FK08 0000S","Rollläden","Stück","2005-12-01","2099-12-31"]
["SMG FK08 0700S","Rollläden","Stück","2005-12-01","2099-12-31"]
["SMG MK04 0000S","Rollläden","Stück","2005-12-01","2099-12-31"]
["SMG MK04 0700S","Rollläden","Stück","2005-12-01","2099-12-31"]
["SMG MK06 0000S","Rollläden","Stück","2005-12-01","2099-12-31"]
["SMG MK06 0700S","Rollläden","Stück","2005-12-01","2099-12-31"]
["SMG MK08 0000S","Rollläden","Stück","2005-12-01","2099-12-31"]
["SMG MK08 0700S","Rollläden","Stück","2005-12-01","2099-12-31"]
["SMG MK10 0000S","Rollläden","Stück","2005-12-01","2099-12-31"]
["SMG MK10 0700S","Rollläden","Stück","2005-12-01","2099-12-31"]
["SMG PK04 0000S","Rollläden","Stück","2005-12-01","2099-12-31"]
["SMG PK04 0700S","Rollläden","Stück","2005-12-01","2099-12-31"]
["SMG PK06 0000S","Rollläden","Stück","2005-12-01","2099-12-31"]
["SMG PK06 0700S","Rollläden","Stück","2005-12-01","2099-12-31"]
["SMG PK08 0000S","Rollläden","Stück","2005-12-01","2099-12-31"]
["SMG PK08 0700S","Rollläden","Stück","2005-12-01","2099-12-31"]
["SMG PK10 0000S","Rollläden","Stück","2005-12-01","2099-12-31"]
["SMG PK10 0700S","Rollläden","Stück","2005-12-01","2099-12-31"]
["SMG SK06 0000S","Rollläden","Stück","2005-12-01","2099-12-31"]
["SMG SK06 0700S","Rollläden","Stück","2005-12-01","2099-12-31"]
["SMG SK08 0000S","Rollläden","Stück","2005-12-01","2099-12-31"]
["SMG SK08 0700S","Rollläden","Stück","2005-12-01","2099-12-31"]
["SMG SK10 0000S","Rollläden","Stück","2005-12-01","2099-12-31"]
["SMG SK10 0700S","Rollläden","Stück","2005-12-01","2099-12-31"]
["SMG UK04 0000S","Rollläden","Stück","2005-12-01","2099-12-31"]
["SMG UK04 0700S","Rollläden","Stück","2005-12-01","2099-12-31"]
["SMG UK08 0000S","Rollläden","Stück","2005-12-01","2099-12-31"]
["SMG UK08 0700S","Rollläden","Stück","2005-12-01","2099-12-31"]
["SMG UK10 0000S","Rollläden","Stück","2005-12-01","2099-12-31"]
["SMG UK10 0700S","Rollläden","Stück","2005-12-01","2099-12-31"]
["SMH FK06 0000S","Rollläden","Stück","2005-12-01","2099-12-31"]
["SMH FK08 0000S","Rollläden","Stück","2005-12-01","2099-12-31"]
["SMH MK06 0000S","Rollläden","Stück","2005-12-01","2099-12-31"]
["SMH MK08 0000S","Rollläden","Stück","2005-12-01","2099-12-31"]
["SMH PK06 0000S","Rollläden","Stück","2005-12-01","2099-12-31"]
["SMH PK08 0000S","Rollläden","Stück","2005-12-01","2099-12-31"]
["SMH SK06 0000S","Rollläden","Stück","2005-12-01","2099-12-31"]
["SMH SK08 0000S","Rollläden","Stück","2005-12-01","2099-12-31"]
["SML CK02 0000S","Rollläden","Stück","2005-12-01","2099-12-31"]
["SML CK02 0100S","Rollläden","Stück","2005-12-01","2099-12-31"]
["SML CK02 0700S","Rollläden","Stück","2005-12-01","2099-12-31"]
["SML CK04 0000S","Rollläden","Stück","2005-12-01","2099-12-31"]
["SML CK04 0100S","Rollläden","Stück","2005-12-01","2099-12-31"]
["SML CK04 0700S","Rollläden","Stück","2005-12-01","2099-12-31"]
["SML CK06 0000S","Rollläden","Stück","2005-12-01","2099-12-31"]
["SML CK06 0100S","Rollläden","Stück","2005-12-01","2099-12-31"]
["SML CK06 0700S","Rollläden","Stück","2005-12-01","2099-12-31"]
["SML FK04 0000S","Rollläden","Stück","2005-12-01","2099-12-31"]
["SML FK04 0100S","Rollläden","Stück","2005-12-01","2099-12-31"]
["SML FK04 0700S","Rollläden","Stück","2005-12-01","2099-12-31"]
["SML FK06 0000S","Rollläden","Stück","2005-12-01","2099-12-31"]
["SML FK06 0100S","Rollläden","Stück","2005-12-01","2099-12-31"]
["SML FK06 0700S","Rollläden","Stück","2005-12-01","2099-12-31"]
["SML FK08 0000S","Rollläden","Stück","2005-12-01","2099-12-31"]
["SML FK08 0100S","Rollläden","Stück","2005-12-01","2099-12-31"]
["SML FK08 0700S","Rollläden","Stück","2005-12-01","2099-12-31"]
["SML MK04 0000S","Rollläden","Stück","2005-12-01","2099-12-31"]
["SML MK04 0100S","Rollläden","Stück","2005-12-01","2099-12-31"]
["SML MK04 0700S","Rollläden","Stück","2005-12-01","2099-12-31"]
["SML MK06 0000S","Rollläden","Stück","2005-12-01","2099-12-31"]
["SML MK06 0100S","Rollläden","Stück","2005-12-01","2099-12-31"]
["SML MK06 0700S","Rollläden","Stück","2005-12-01","2099-12-31"]
["SML MK08 0000S","Rollläden","Stück","2005-12-01","2099-12-31"]
["SML MK08 0100S","Rollläden","Stück","2005-12-01","2099-12-31"]
["SML MK08 0700S","Rollläden","Stück","2005-12-01","2099-12-31"]
["SML MK10 0000S","Rollläden","Stück","2005-12-01","2099-12-31"]
["SML MK10 0100S","Rollläden","Stück","2005-12-01","2099-12-31"]
["SML MK10 0700S","Rollläden","Stück","2005-12-01","2099-12-31"]
["SML MK12 0000S","Rollläden","Stück","2005-12-01","2099-12-31"]
["SML MK12 0100S","Rollläden","Stück","2005-12-01","2099-12-31"]
["SML MK12 0700S","Rollläden","Stück","2005-12-01","2099-12-31"]
["SML PK04 0000S","Rollläden","Stück","2005-12-01","2099-12-31"]
["SML PK04 0100S","Rollläden","Stück","2005-12-01","2099-12-31"]
["SML PK04 0700S","Rollläden","Stück","2005-12-01","2099-12-31"]
["SML PK06 0000S","Rollläden","Stück","2005-12-01","2099-12-31"]
["SML PK06 0100S","Rollläden","Stück","2005-12-01","2099-12-31"]
["SML PK06 0700S","Rollläden","Stück","2005-12-01","2099-12-31"]
["SML PK08 0000S","Rollläden","Stück","2005-12-01","2099-12-31"]
["SML PK08 0100S","Rollläden","Stück","2005-12-01","2099-12-31"]
["SML PK08 0700S","Rollläden","Stück","2005-12-01","2099-12-31"]
["SML PK10 0000S","Rollläden","Stück","2005-12-01","2099-12-31"]
["SML PK10 0100S","Rollläden","Stück","2005-12-01","2099-12-31"]
["SML PK10 0700S","Rollläden","Stück","2005-12-01","2099-12-31"]
["SML SK06 0000S","Rollläden","Stück","2005-12-01","2099-12-31"]
["SML SK06 0100S","Rollläden","Stück","2005-12-01","2099-12-31"]
["SML SK06 0700S","Rollläden","Stück","2005-12-01","2099-12-31"]
["SML SK08 0000S","Rollläden","Stück","2005-12-01","2099-12-31"]
["SML SK08 0100S","Rollläden","Stück","2005-12-01","2099-12-31"]
["SML SK08 0700S","Rollläden","Stück","2005-12-01","2099-12-31"]
["SML SK10 0000S","Rollläden","Stück","2005-12-01","2099-12-31"]
["SML SK10 0100S","Rollläden","Stück","2005-12-01","2099-12-31"]
["SML SK10 0700S","Rollläden","Stück","2005-12-01","2099-12-31"]
["SML UK04 0000S","Rollläden","Stück","2005-12-01","2099-12-31"]
["SML UK04 0100S","Rollläden","Stück","2005-12-01","2099-12-31"]
["SML UK04 0700S","Rollläden","Stück","2005-12-01","2099-12-31"]
["SML UK08 0000S","Rollläden","Stück","2005-12-01","2099-12-31"]
["SML UK08 0100S","Rollläden","Stück","2005-12-01","2099-12-31"]
["SML UK08 0700S","Rollläden","Stück","2005-12-01","2099-12-31"]
["SML UK10 0000S","Rollläden","Stück","2005-12-01","2099-12-31"]
["SML UK10 0100S","Rollläden","Stück","2005-12-01","2099-12-31"]
["SML UK10 0700S","Rollläden","Stück","2005-12-01","2099-12-31"]
["SML YK21 0000S","Rollläden","Stück","2005-12-01","2099-12-31"]
["SML YK21 0100S","Rollläden","Stück","2005-12-01","2099-12-31"]
["SML YK23 0000S","Rollläden","Stück","2005-12-01","2099-12-31"]
["SML YK23 0100S","Rollläden","Stück","2005-12-01","2099-12-31"]
["SML YK33 0000S","Rollläden","Stück","2005-12-01","2099-12-31"]
["SML YK33 0100S","Rollläden","Stück","2005-12-01","2099-12-31"]
["SML YK35 0000S","Rollläden","Stück","2005-12-01","2099-12-31"]
["SML YK35 0100S","Rollläden","Stück","2005-12-01","2099-12-31"]
["SML YK43 0000S","Rollläden","Stück","2005-12-01","2099-12-31"]
["SML YK43 0100S","Rollläden","Stück","2005-12-01","2099-12-31"]
["SML YK45 0000S","Rollläden","Stück","2005-12-01","2099-12-31"]
["SML YK45 0100S","Rollläden","Stück","2005-12-01","2099-12-31"]
["SML YK47 0000S","Rollläden","Stück","2005-12-01","2099-12-31"]
["SML YK47 0100S","Rollläden","Stück","2005-12-01","2099-12-31"]
["SML YK65 0000S","Rollläden","Stück","2005-12-01","2099-12-31"]
["SML YK65 0100S","Rollläden","Stück","2005-12-01","2099-12-31"]
["SML YK67 0000S","Rollläden","Stück","2005-12-01","2099-12-31"]
["SML YK67 0100S","Rollläden","Stück","2005-12-01","2099-12-31"]
["SML YK85 0000S","Rollläden","Stück","2005-12-01","2099-12-31"]
["SML YK85 0100S","Rollläden","Stück","2005-12-01","2099-12-31"]
["SML YK87 0000S","Rollläden","Stück","2005-12-01","2099-12-31"]
["SML YK87 0100S","Rollläden","Stück","2005-12-01","2099-12-31"]
["SML YK89 0000S","Rollläden","Stück","2005-12-01","2099-12-31"]
["SML YK89 0100S","Rollläden","Stück","2005-12-01","2099-12-31"]
["SML YK97 0000S","Rollläden","Stück","2005-12-01","2099-12-31"]
["SML YK97 0100S","Rollläden","Stück","2005-12-01","2099-12-31"]
["SML YK99 0000S","Rollläden","Stück","2005-12-01","2099-12-31"]
["SML YK99 0100S","Rollläden","Stück","2005-12-01","2099-12-31"]
["SSI FK04 0000S","Rollläden","Stück","2005-12-01","2099-12-31"]
["SSI FK06 0000S","Rollläden","Stück","2005-12-01","2099-12-31"]
["SSI FK08 0000S","Rollläden","Stück","2005-12-01","2099-12-31"]
["SSI MK04 0000S","Rollläden","Stück","2005-12-01","2099-12-31"]
["SSI MK06 0000S","Rollläden","Stück","2005-12-01","2099-12-31"]
["SSI MK08 0000S","Rollläden","Stück","2005-12-01","2099-12-31"]
["SSI MK10 0000S","Rollläden","Stück","2005-12-01","2099-12-31"]
["SSI PK04 0000S","Rollläden","Stück","2005-12-01","2099-12-31"]
["SSI PK06 0000S","Rollläden","Stück","2005-12-01","2099-12-31"]
["SSI PK08 0000S","Rollläden","Stück","2005-12-01","2099-12-31"]
["SSI PK10 0000S","Rollläden","Stück","2005-12-01","2099-12-31"]
["SSI SK06 0000S","Rollläden","Stück","2005-12-01","2099-12-31"]
["SSI SK08 0000S","Rollläden","Stück","2005-12-01","2099-12-31"]
["SSI SK10 0000S","Rollläden","Stück","2005-12-01","2099-12-31"]
["SSI UK04 0000S","Rollläden","Stück","2005-12-01","2099-12-31"]
["SSI UK08 0000S","Rollläden","Stück","2005-12-01","2099-12-31"]
["SSI UK10 0000S","Rollläden","Stück","2005-12-01","2099-12-31"]
["SSL 021 0000S","Rollläden","Stück","2005-12-01","2099-12-31"]
["SSL 021 0100S","Rollläden","Stück","2005-12-01","2099-12-31"]
["SSL 023 0000S","Rollläden","Stück","2005-12-01","2099-12-31"]
["SSL 023 0100S","Rollläden","Stück","2005-12-01","2099-12-31"]
["SSL 033 0000S","Rollläden","Stück","2005-12-01","2099-12-31"]
["SSL 033 0100S","Rollläden","Stück","2005-12-01","2099-12-31"]
["SSL 035 0000S","Rollläden","Stück","2005-12-01","2099-12-31"]
["SSL 035 0100S","Rollläden","Stück","2005-12-01","2099-12-31"]
["SSL 043 0000S","Rollläden","Stück","2005-12-01","2099-12-31"]
["SSL 043 0100S","Rollläden","Stück","2005-12-01","2099-12-31"]
["SSL 045 0000S","Rollläden","Stück","2005-12-01","2099-12-31"]
["SSL 045 0100S","Rollläden","Stück","2005-12-01","2099-12-31"]
["SSL 047 0000S","Rollläden","Stück","2005-12-01","2099-12-31"]
["SSL 047 0100S","Rollläden","Stück","2005-12-01","2099-12-31"]
["SSL 065 0000S","Rollläden","Stück","2005-12-01","2099-12-31"]
["SSL 065 0100S","Rollläden","Stück","2005-12-01","2099-12-31"]
["SSL 067 0000S","Rollläden","Stück","2005-12-01","2099-12-31"]
["SSL 067 0100S","Rollläden","Stück","2005-12-01","2099-12-31"]
["SSL 0811 0000S","Rollläden","Stück","2005-12-01","2099-12-31"]
["SSL 085 0000S","Rollläden","Stück","2005-12-01","2099-12-31"]
["SSL 085 0100S","Rollläden","Stück","2005-12-01","2099-12-31"]
["SSL 087 0000S","Rollläden","Stück","2005-12-01","2099-12-31"]
["SSL 087 0100S","Rollläden","Stück","2005-12-01","2099-12-31"]
["SSL 089 0000S","Rollläden","Stück","2005-12-01","2099-12-31"]
["SSL 089 0100S","Rollläden","Stück","2005-12-01","2099-12-31"]
["SSL 1011 0000S","Rollläden","Stück","2005-12-01","2099-12-31"]
["SSL 1014 0000S","Rollläden","Stück","2005-12-01","2099-12-31"]
["SSL 107 0000S","Rollläden","Stück","2005-12-01","2099-12-31"]
["SSL 107 0100S","Rollläden","Stück","2005-12-01","2099-12-31"]
["SSL 109 0000S","Rollläden","Stück","2005-12-01","2099-12-31"]
["SSL 109 0100S","Rollläden","Stück","2005-12-01","2099-12-31"]
["SSL CK02 0000S","Rollläden","Stück","2005-12-01","2099-12-31"]
["SSL CK02 0100S","Rollläden","Stück","2005-12-01","2099-12-31"]
["SSL CK02 0700S","Rollläden","Stück","2005-12-01","2099-12-31"]
["SSL CK04 0000S","Rollläden","Stück","2005-12-01","2099-12-31"]
["SSL CK04 0100S","Rollläden","Stück","2005-12-01","2099-12-31"]
["SSL CK04 0700S","Rollläden","Stück","2005-12-01","2099-12-31"]
["SSL CK06 0000S","Rollläden","Stück","2005-12-01","2099-12-31"]
["SSL CK06 0100S","Rollläden","Stück","2005-12-01","2099-12-31"]
["SSL CK06 0700S","Rollläden","Stück","2005-12-01","2099-12-31"]
["SSL FK04 0000S","Rollläden","Stück","2005-12-01","2099-12-31"]
["SSL FK04 0100S","Rollläden","Stück","2005-12-01","2099-12-31"]
["SSL FK04 0700S","Rollläden","Stück","2005-12-01","2099-12-31"]
["SSL FK06 0000S","Rollläden","Stück","2005-12-01","2099-12-31"]
["SSL FK06 0100S","Rollläden","Stück","2005-12-01","2099-12-31"]
["SSL FK06 0700S","Rollläden","Stück","2005-12-01","2099-12-31"]
["SSL FK08 0000S","Rollläden","Stück","2005-12-01","2099-12-31"]
["SSL FK08 0100S","Rollläden","Stück","2005-12-01","2099-12-31"]
["SSL FK08 0700S","Rollläden","Stück","2005-12-01","2099-12-31"]
["SSL MK04 0000S","Rollläden","Stück","2005-12-01","2099-12-31"]
["SSL MK04 0100S","Rollläden","Stück","2005-12-01","2099-12-31"]
["SSL MK04 0700S","Rollläden","Stück","2005-12-01","2099-12-31"]
["SSL MK06 0000S","Rollläden","Stück","2005-12-01","2099-12-31"]
["SSL MK06 0100S","Rollläden","Stück","2005-12-01","2099-12-31"]
["SSL MK06 0700S","Rollläden","Stück","2005-12-01","2099-12-31"]
["SSL MK08 0000S","Rollläden","Stück","2005-12-01","2099-12-31"]
["SSL MK08 0100S","Rollläden","Stück","2005-12-01","2099-12-31"]
["SSL MK08 0700S","Rollläden","Stück","2005-12-01","2099-12-31"]
["SSL MK10 0000S","Rollläden","Stück","2005-12-01","2099-12-31"]
["SSL MK10 0100S","Rollläden","Stück","2005-12-01","2099-12-31"]
["SSL MK10 0700S","Rollläden","Stück","2005-12-01","2099-12-31"]
["SSL MK12 0000S","Rollläden","Stück","2005-12-01","2099-12-31"]
["SSL MK12 0100S","Rollläden","Stück","2005-12-01","2099-12-31"]
["SSL MK12 0700S","Rollläden","Stück","2005-12-01","2099-12-31"]
["SSL PK04 0000S","Rollläden","Stück","2005-12-01","2099-12-31"]
["SSL PK04 0100S","Rollläden","Stück","2005-12-01","2099-12-31"]
["SSL PK04 0700S","Rollläden","Stück","2005-12-01","2099-12-31"]
["SSL PK06 0000S","Rollläden","Stück","2005-12-01","2099-12-31"]
["SSL PK06 0100S","Rollläden","Stück","2005-12-01","2099-12-31"]
["SSL PK06 0700S","Rollläden","Stück","2005-12-01","2099-12-31"]
["SSL PK08 0000S","Rollläden","Stück","2005-12-01","2099-12-31"]
["SSL PK08 0100S","Rollläden","Stück","2005-12-01","2099-12-31"]
["SSL PK08 0700S","Rollläden","Stück","2005-12-01","2099-12-31"]
["SSL PK10 0000S","Rollläden","Stück","2005-12-01","2099-12-31"]
["SSL PK10 0100S","Rollläden","Stück","2005-12-01","2099-12-31"]
["SSL PK10 0700S","Rollläden","Stück","2005-12-01","2099-12-31"]
["SSL SK06 0000S","Rollläden","Stück","2005-12-01","2099-12-31"]
["SSL SK06 0100S","Rollläden","Stück","2005-12-01","2099-12-31"]
["SSL SK06 0700S","Rollläden","Stück","2005-12-01","2099-12-31"]
["SSL SK08 0000S","Rollläden","Stück","2005-12-01","2099-12-31"]
["SSL SK08 0100S","Rollläden","Stück","2005-12-01","2099-12-31"]
["SSL SK08 0700S","Rollläden","Stück","2005-12-01","2099-12-31"]
["SSL SK10 0000S","Rollläden","Stück","2005-12-01","2099-12-31"]
["SSL SK10 0100S","Rollläden","Stück","2005-12-01","2099-12-31"]
["SSL SK10 0700S","Rollläden","Stück","2005-12-01","2099-12-31"]
["SSL UK04 0000S","Rollläden","Stück","2005-12-01","2099-12-31"]
["SSL UK04 0100S","Rollläden","Stück","2005-12-01","2099-12-31"]
["SSL UK04 0700S","Rollläden","Stück","2005-12-01","2099-12-31"]
["SSL UK08 0000S","Rollläden","Stück","2005-12-01","2099-12-31"]
["SSL UK08 0100S","Rollläden","Stück","2005-12-01","2099-12-31"]
["SSL UK08 0700S","Rollläden","Stück","2005-12-01","2099-12-31"]
["SSL UK10 0000S","Rollläden","Stück","2005-12-01","2099-12-31"]
["SSL UK10 0100S","Rollläden","Stück","2005-12-01","2099-12-31"]
["SSL UK10 0700S","Rollläden","Stück","2005-12-01","2099-12-31"]
["SSL YK21 0000S","Rollläden","Stück","2005-12-01","2099-12-31"]
["SSL YK21 0100S","Rollläden","Stück","2005-12-01","2099-12-31"]
["SSL YK23 0000S","Rollläden","Stück","2005-12-01","2099-12-31"]
["SSL YK23 0100S","Rollläden","Stück","2005-12-01","2099-12-31"]
["SSL YK33 0000S","Rollläden","Stück","2005-12-01","2099-12-31"]
["SSL YK33 0100S","Rollläden","Stück","2005-12-01","2099-12-31"]
["SSL YK35 0000S","Rollläden","Stück","2005-12-01","2099-12-31"]
["SSL YK35 0100S","Rollläden","Stück","2005-12-01","2099-12-31"]
["SSL YK43 0000S","Rollläden","Stück","2005-12-01","2099-12-31"]
["SSL YK43 0100S","Rollläden","Stück","2005-12-01","2099-12-31"]
["SSL YK45 0000S","Rollläden","Stück","2005-12-01","2099-12-31"]
["SSL YK45 0100S","Rollläden","Stück","2005-12-01","2099-12-31"]
["SSL YK47 0000S","Rollläden","Stück","2005-12-01","2099-12-31"]
["SSL YK47 0100S","Rollläden","Stück","2005-12-01","2099-12-31"]
["SSL YK65 0000S","Rollläden","Stück","2005-12-01","2099-12-31"]
["SSL YK65 0100S","Rollläden","Stück","2005-12-01","2099-12-31"]
["SSL YK67 0000S","Rollläden","Stück","2005-12-01","2099-12-31"]
["SSL YK67 0100S","Rollläden","Stück","2005-12-01","2099-12-31"]
["SSL YK85 0000S","Rollläden","Stück","2005-12-01","2099-12-31"]
["SSL YK85 0100S","Rollläden","Stück","2005-12-01","2099-12-31"]
["SSL YK87 0000S","Rollläden","Stück","2005-12-01","2099-12-31"]
["SSL YK87 0100S","Rollläden","Stück","2005-12-01","2099-12-31"]
["SSL YK89 0000S","Rollläden","Stück","2005-12-01","2099-12-31"]
["SSL YK89 0100S","Rollläden","Stück","2005-12-01","2099-12-31"]
["SSL YK97 0000S","Rollläden","Stück","2005-12-01","2099-12-31"]
["SSL YK97 0100S","Rollläden","Stück","2005-12-01","2099-12-31"]
["SSL YK99 0000S","Rollläden","Stück","2005-12-01","2099-12-31"]
["SSL YK99 0100S","Rollläden","Stück","2005-12-01","2099-12-31"]
["SSLS FFKF06 0000S","Rollläden","Stück","2005-12-01","2099-12-31"]
["SSLS FFKF08 0000S","Rollläden","Stück","2005-12-01","2099-12-31"]
["SSS CK02 0000S","Rollläden","Stück","2005-12-01","2099-12-31"]
["SSS CK04 0000S","Rollläden","Stück","2005-12-01","2099-12-31"]
["SSS CK06 0000S","Rollläden","Stück","2005-12-01","2099-12-31"]
["SSS FK04 0000S","Rollläden","Stück","2005-12-01","2099-12-31"]
["SSS FK06 0000S","Rollläden","Stück","2005-12-01","2099-12-31"]
["SSS FK08 0000S","Rollläden","Stück","2005-12-01","2099-12-31"]
["SSS MK04 0000S","Rollläden","Stück","2005-12-01","2099-12-31"]
["SSS MK06 0000S","Rollläden","Stück","2005-12-01","2099-12-31"]
["SSS MK08 0000S","Rollläden","Stück","2005-12-01","2099-12-31"]
["SSS MK10 0000S","Rollläden","Stück","2005-12-01","2099-12-31"]
["SSS MK12 0000S","Rollläden","Stück","2005-12-01","2099-12-31"]
["SSS PK04 0000S","Rollläden","Stück","2005-12-01","2099-12-31"]
["SSS PK06 0000S","Rollläden","Stück","2005-12-01","2099-12-31"]
["SSS PK08 0000S","Rollläden","Stück","2005-12-01","2099-12-31"]
["SSS PK10 0000S","Rollläden","Stück","2005-12-01","2099-12-31"]
["SSS SK06 0000S","Rollläden","Stück","2005-12-01","2099-12-31"]
["SSS SK08 0000S","Rollläden","Stück","2005-12-01","2099-12-31"]
["SSS SK10 0000S","Rollläden","Stück","2005-12-01","2099-12-31"]
["SSS UK04 0000S","Rollläden","Stück","2005-12-01","2099-12-31"]
["SSS UK08 0000S","Rollläden","Stück","2005-12-01","2099-12-31"]
["SSS UK10 0000S","Rollläden","Stück","2005-12-01","2099-12-31"]
["SSS YK21 0000S","Rollläden","Stück","2005-12-01","2099-12-31"]
["SSS YK23 0000S","Rollläden","Stück","2005-12-01","2099-12-31"]
["SSS YK33 0000S","Rollläden","Stück","2005-12-01","2099-12-31"]
["SSS YK35 0000S","Rollläden","Stück","2005-12-01","2099-12-31"]
["SSS YK43 0000S","Rollläden","Stück","2005-12-01","2099-12-31"]
["SSS YK45 0000S","Rollläden","Stück","2005-12-01","2099-12-31"]
["SSS YK47 0000S","Rollläden","Stück","2005-12-01","2099-12-31"]
["SSS YK65 0000S","Rollläden","Stück","2005-12-01","2099-12-31"]
["SSS YK67 0000S","Rollläden","Stück","2005-12-01","2099-12-31"]
["SSS YK85 0000S","Rollläden","Stück","2005-12-01","2099-12-31"]
["SSS YK87 0000S","Rollläden","Stück","2005-12-01","2099-12-31"]
["SSS YK89 0000S","Rollläden","Stück","2005-12-01","2099-12-31"]
["SSS YK97 0000S","Rollläden","Stück","2005-12-01","2099-12-31"]
["SSS YK99 0000S","Rollläden","Stück","2005-12-01","2099-12-31"]
["SSSS FFKF06 0000S","Rollläden","Stück","2005-12-01","2099-12-31"]
["SSSS FFKF08 0000S","Rollläden","Stück","2005-12-01","2099-12-31"]
["SST MK08 0000","Rollläden","Stück","2005-12-01","2099-12-31"]
["SST SK08 0000","Rollläden","Stück","2005-12-01","2099-12-31"]
["SST SK10 0000","Rollläden","Stück","2005-12-01","2099-12-31"]

{"sheet":"Contact","index":7,"n_rows":19,"n_cols":5,"rows_kept":19,"cut":false,"hidden":false,"merged":[]}
[]
[]
[]
[]
[null,null,{"$f":"VLOOKUP(122,TextID,CODE(Language!$B$4)-64,FALSE)","v":"VELUX Kontakt"}]
[]
[null,null,null,"VELUX Deutschland GmbH"]
[null,null,null,"Lagerbestand"]
[null,null,null,"Postfach 54 02 60"]
[null,null,null,"22502 Hamburg"]
[]
[null,null,null,"Kostenlose VELUX Service-Nummer Händler"]
[null,null,null,"0800 / 3 24 24 04*"]
[]
[null,null,null,"E-Mail:","lagerbestand@VELUX.de"]
[null,null,null,"Web:","www.VELUX.de"]
[]
[]
[null,null,null,"* Kostenlos aus deutschen Netzen."]

{"sheet":"Information","index":8,"n_rows":5,"n_cols":3,"rows_kept":5,"cut":false,"hidden":false,"merged":[]}
[]
[]
[]
[]
[null,null,{"$f":"VLOOKUP(131,TextID,CODE(Language!$B$4)-64,FALSE)&\" (gültig für 2024)\"","v":"Weitere Informationen (gültig für 2024)"}]

{"sheet":"Customer","index":9,"n_rows":33,"n_cols":5,"rows_kept":33,"cut":false,"hidden":false,"merged":[]}
[]
[]
[]
[]
[null,null,{"$f":"VLOOKUP(132,TextID,CODE(Language!$B$4)-64,FALSE)","v":"Kundenstammdaten"}]
[null,null,null,null,{"$f":"VLOOKUP(134,TextID,CODE(Language!$B$4)-64,FALSE)","v":"* Eingabe erforderlich"}]
[null,null,null,{"$f":"VLOOKUP(136,TextID,CODE(Language!$B$4)-64,FALSE)","v":"* Kundennummer"}]
[null,null,null,{"$f":"VLOOKUP(138,TextID,CODE(Language!$B$4)-64)","v":"* Firmenname"}]
[null,null,null,{"$f":"VLOOKUP(140,TextID,CODE(Language!$B$4)-64,FALSE)","v":"* Strasse"}]
[null,null,null,{"$f":"VLOOKUP(142,TextID,CODE(Language!$B$4)-64,FALSE)","v":"* Postleitzahl"}]
[null,null,null,{"$f":"VLOOKUP(144,TextID,CODE(Language!$B$4)-64,FALSE)","v":"* Ort"}]
[]
[null,null,null,{"$f":"VLOOKUP(146,TextID,CODE(Language!$B$4)-64,FALSE)","v":"* Name Bearbeiter"}]
[null,null,null,{"$f":"VLOOKUP(148,TextID,CODE(Language!$B$4)-64,FALSE)","v":"Telefon"}]
[null,null,null,{"$f":"VLOOKUP(150,TextID,CODE(Language!$B$4)-64,FALSE)","v":"E-mail"}]
[]
[]
[]
[]
[]
[]
[]
[]
[]
[]
[]
[]
[]
[]
[]
[]
[]
[null,null,"XLS02A"]

{"sheet":"Report1","index":10,"n_rows":162,"n_cols":12,"rows_kept":162,"cut":false,"hidden":false,"merged":[]}
[]
[]
[]
[]
[null,null,{"$f":"VLOOKUP(168,TextID,CODE(Language!$B$4)-64,FALSE)","v":"Meldeformular Fenster"},null,null,null,null,null,null,{"$f":"IF(OR(Customer!E7=\"\",Customer!E8=\"\"),VLOOKUP(304,TextID,CODE(Language!$B$4)-64,FALSE),CONCATENATE(Customer!E7,\" \",LEFT(Customer!E8,30)))","v":"Kundenname und/oder Nummer fehlt "}]
[null,null,null,null,null,{"$f":"VLOOKUP(326,TextID,CODE(Language!$B$4)-64,FALSE)","v":"* Zählung am:"}]
[null,null,null,null,null,{"$f":"VLOOKUP(226,TextID,CODE(Language!$B$4)-64,FALSE)","v":"* Meldung:"},null,null,null,{"$f":"VLOOKUP(170,TextID,CODE(Language!$B$4)-64,FALSE)","v":"* Eingabe erforderlich"}]
[null,null,null,null,null,{"$f":"VLOOKUP(228,TextID,CODE(Language!$B$4)-64,FALSE)","v":"* Jahr:"},null,null,2024]
[null,null,null,null,null,null,null,null,{"$f":"IF(OR(I7=\"\",I8=\"\"),\"\",DATE(I8,MONTH(VLOOKUP(I7,ReportPeriod1b,2,FALSE)),DAY(VLOOKUP(I7,ReportPeriod1b,2,FALSE))))","v":""},{"$f":"IF(I6<40000,\"\",I6)","v":""}]
[]
[null,null,null,null,null,{"$f":"VLOOKUP(172,TextID,CODE(Language!$B$4)-64,FALSE)","v":"Total:"},null,null,{"$f":"SUM(I14:I162)","v":0}]
[null,null,null,null,{"$f":"VLOOKUP(182,TextID,CODE(Language!$B$4)-64,FALSE)","v":"Artikkelnummer"},{"$f":"VLOOKUP(184,TextID,CODE(Language!$B$4)-64,FALSE)","v":"Gruppe"},"Einheit",null,{"$f":"VLOOKUP(186,TextID,CODE(Language!$B$4)-64,FALSE)","v":"Bestand"},{"$f":"VLOOKUP(192,TextID,CODE(Language!$B$4)-64,FALSE)","v":"Status"}]
[null,null,null,"CustNo","Material","MatType","UM","StockDate","StockQty","Status"]
[null,null,null,{"$f":"IF(E14=\"\",\"\",Customer!E$7)","v":""},null,{"$f":"IF($E14=\"\",\"\",VLOOKUP($E14,Material1b,2))","v":""},{"$f":"IF($E14=\"\",\"\",VLOOKUP($E14,Material1b,3))","v":""},{"$f":"IF(E14=\"\",\"\",I$9)","v":""},null,{"$f":"CONCATENATE(IF(AND(E14<>\"\",OR(I$9=\"\",J$9=\"\")),VLOOKUP(300,TextID,CODE(Language!$B$4)-64,FALSE),\"\"),IF(AND(E14<>\"\",I14=\"\"),VLOOKUP(302,TextID,CODE(Language!$B$4)-64,FALSE),\"\"),IF(AND(E14=\"\",I14<>\"\"),VLOOKUP(306,TextID,CODE(Language!$B$4)-64,FALSE),\"\"),IF(AND(E14<>\"\",E14=E13),VLOOKUP(308,TextID,CODE(Language!$B$4)-64,FALSE),\"\"),IF(AND(E14<>\"\",LEFT(E14,2)=\"GV\"),VLOOKUP(328,Language!A:F,6,FALSE),\"\"))","v":""},null,{"$f":"IF(E14=\"\",\"\",I$6)","v":""}]
[null,null,null,{"$f":"IF(E15=\"\",\"\",Customer!E$7)","v":""},null,"","","",null,{"$f":"CONCATENATE(IF(AND(E15<>\"\",OR(I$9=\"\",J$9=\"\")),VLOOKUP(300,TextID,CODE(Language!$B$4)-64,FALSE),\"\"),IF(AND(E15<>\"\",I15=\"\"),VLOOKUP(302,TextID,CODE(Language!$B$4)-64,FALSE),\"\"),IF(AND(E15=\"\",I15<>\"\"),VLOOKUP(306,TextID,CODE(Language!$B$4)-64,FALSE),\"\"),IF(AND(E15<>\"\",E15=E14),VLOOKUP(308,TextID,CODE(Language!$B$4)-64,FALSE),\"\"),IF(AND(E15<>\"\",LEFT(E15,2)=\"GV\"),VLOOKUP(328,Language!A:F,6,FALSE),\"\"))","v":""},null,""]
[null,null,null,{"$f":"IF(E16=\"\",\"\",Customer!E$7)","v":""},null,"","","",null,{"$f":"CONCATENATE(IF(AND(E16<>\"\",OR(I$9=\"\",J$9=\"\")),VLOOKUP(300,TextID,CODE(Language!$B$4)-64,FALSE),\"\"),IF(AND(E16<>\"\",I16=\"\"),VLOOKUP(302,TextID,CODE(Language!$B$4)-64,FALSE),\"\"),IF(AND(E16=\"\",I16<>\"\"),VLOOKUP(306,TextID,CODE(Language!$B$4)-64,FALSE),\"\"),IF(AND(E16<>\"\",E16=E15),VLOOKUP(308,TextID,CODE(Language!$B$4)-64,FALSE),\"\"),IF(AND(E16<>\"\",LEFT(E16,2)=\"GV\"),VLOOKUP(328,Language!A:F,6,FALSE),\"\"))","v":""},null,""]
[null,null,null,{"$f":"IF(E17=\"\",\"\",Customer!E$7)","v":""},null,"","","",null,{"$f":"CONCATENATE(IF(AND(E17<>\"\",OR(I$9=\"\",J$9=\"\")),VLOOKUP(300,TextID,CODE(Language!$B$4)-64,FALSE),\"\"),IF(AND(E17<>\"\",I17=\"\"),VLOOKUP(302,TextID,CODE(Language!$B$4)-64,FALSE),\"\"),IF(AND(E17=\"\",I17<>\"\"),VLOOKUP(306,TextID,CODE(Language!$B$4)-64,FALSE),\"\"),IF(AND(E17<>\"\",E17=E16),VLOOKUP(308,TextID,CODE(Language!$B$4)-64,FALSE),\"\"),IF(AND(E17<>\"\",LEFT(E17,2)=\"GV\"),VLOOKUP(328,Language!A:F,6,FALSE),\"\"))","v":""},null,""]
[null,null,null,{"$f":"IF(E18=\"\",\"\",Customer!E$7)","v":""},null,"","","",null,{"$f":"CONCATENATE(IF(AND(E18<>\"\",OR(I$9=\"\",J$9=\"\")),VLOOKUP(300,TextID,CODE(Language!$B$4)-64,FALSE),\"\"),IF(AND(E18<>\"\",I18=\"\"),VLOOKUP(302,TextID,CODE(Language!$B$4)-64,FALSE),\"\"),IF(AND(E18=\"\",I18<>\"\"),VLOOKUP(306,TextID,CODE(Language!$B$4)-64,FALSE),\"\"),IF(AND(E18<>\"\",E18=E17),VLOOKUP(308,TextID,CODE(Language!$B$4)-64,FALSE),\"\"),IF(AND(E18<>\"\",LEFT(E18,2)=\"GV\"),VLOOKUP(328,Language!A:F,6,FALSE),\"\"))","v":""},null,""]
[null,null,null,{"$f":"IF(E19=\"\",\"\",Customer!E$7)","v":""},null,"","","",null,{"$f":"CONCATENATE(IF(AND(E19<>\"\",OR(I$9=\"\",J$9=\"\")),VLOOKUP(300,TextID,CODE(Language!$B$4)-64,FALSE),\"\"),IF(AND(E19<>\"\",I19=\"\"),VLOOKUP(302,TextID,CODE(Language!$B$4)-64,FALSE),\"\"),IF(AND(E19=\"\",I19<>\"\"),VLOOKUP(306,TextID,CODE(Language!$B$4)-64,FALSE),\"\"),IF(AND(E19<>\"\",E19=E18),VLOOKUP(308,TextID,CODE(Language!$B$4)-64,FALSE),\"\"),IF(AND(E19<>\"\",LEFT(E19,2)=\"GV\"),VLOOKUP(328,Language!A:F,6,FALSE),\"\"))","v":""},null,""]
[null,null,null,{"$f":"IF(E20=\"\",\"\",Customer!E$7)","v":""},null,"","","",null,{"$f":"CONCATENATE(IF(AND(E20<>\"\",OR(I$9=\"\",J$9=\"\")),VLOOKUP(300,TextID,CODE(Language!$B$4)-64,FALSE),\"\"),IF(AND(E20<>\"\",I20=\"\"),VLOOKUP(302,TextID,CODE(Language!$B$4)-64,FALSE),\"\"),IF(AND(E20=\"\",I20<>\"\"),VLOOKUP(306,TextID,CODE(Language!$B$4)-64,FALSE),\"\"),IF(AND(E20<>\"\",E20=E19),VLOOKUP(308,TextID,CODE(Language!$B$4)-64,FALSE),\"\"),IF(AND(E20<>\"\",LEFT(E20,2)=\"GV\"),VLOOKUP(328,Language!A:F,6,FALSE),\"\"))","v":""},null,""]
[null,null,null,{"$f":"IF(E21=\"\",\"\",Customer!E$7)","v":""},null,"","","",null,{"$f":"CONCATENATE(IF(AND(E21<>\"\",OR(I$9=\"\",J$9=\"\")),VLOOKUP(300,TextID,CODE(Language!$B$4)-64,FALSE),\"\"),IF(AND(E21<>\"\",I21=\"\"),VLOOKUP(302,TextID,CODE(Language!$B$4)-64,FALSE),\"\"),IF(AND(E21=\"\",I21<>\"\"),VLOOKUP(306,TextID,CODE(Language!$B$4)-64,FALSE),\"\"),IF(AND(E21<>\"\",E21=E20),VLOOKUP(308,TextID,CODE(Language!$B$4)-64,FALSE),\"\"),IF(AND(E21<>\"\",LEFT(E21,2)=\"GV\"),VLOOKUP(328,Language!A:F,6,FALSE),\"\"))","v":""},null,""]
[null,null,null,{"$f":"IF(E22=\"\",\"\",Customer!E$7)","v":""},null,"","","",null,{"$f":"CONCATENATE(IF(AND(E22<>\"\",OR(I$9=\"\",J$9=\"\")),VLOOKUP(300,TextID,CODE(Language!$B$4)-64,FALSE),\"\"),IF(AND(E22<>\"\",I22=\"\"),VLOOKUP(302,TextID,CODE(Language!$B$4)-64,FALSE),\"\"),IF(AND(E22=\"\",I22<>\"\"),VLOOKUP(306,TextID,CODE(Language!$B$4)-64,FALSE),\"\"),IF(AND(E22<>\"\",E22=E21),VLOOKUP(308,TextID,CODE(Language!$B$4)-64,FALSE),\"\"),IF(AND(E22<>\"\",LEFT(E22,2)=\"GV\"),VLOOKUP(328,Language!A:F,6,FALSE),\"\"))","v":""},null,""]
[null,null,null,{"$f":"IF(E23=\"\",\"\",Customer!E$7)","v":""},null,"","","",null,{"$f":"CONCATENATE(IF(AND(E23<>\"\",OR(I$9=\"\",J$9=\"\")),VLOOKUP(300,TextID,CODE(Language!$B$4)-64,FALSE),\"\"),IF(AND(E23<>\"\",I23=\"\"),VLOOKUP(302,TextID,CODE(Language!$B$4)-64,FALSE),\"\"),IF(AND(E23=\"\",I23<>\"\"),VLOOKUP(306,TextID,CODE(Language!$B$4)-64,FALSE),\"\"),IF(AND(E23<>\"\",E23=E22),VLOOKUP(308,TextID,CODE(Language!$B$4)-64,FALSE),\"\"),IF(AND(E23<>\"\",LEFT(E23,2)=\"GV\"),VLOOKUP(328,Language!A:F,6,FALSE),\"\"))","v":""},null,""]
[null,null,null,{"$f":"IF(E24=\"\",\"\",Customer!E$7)","v":""},null,"","","",null,{"$f":"CONCATENATE(IF(AND(E24<>\"\",OR(I$9=\"\",J$9=\"\")),VLOOKUP(300,TextID,CODE(Language!$B$4)-64,FALSE),\"\"),IF(AND(E24<>\"\",I24=\"\"),VLOOKUP(302,TextID,CODE(Language!$B$4)-64,FALSE),\"\"),IF(AND(E24=\"\",I24<>\"\"),VLOOKUP(306,TextID,CODE(Language!$B$4)-64,FALSE),\"\"),IF(AND(E24<>\"\",E24=E23),VLOOKUP(308,TextID,CODE(Language!$B$4)-64,FALSE),\"\"),IF(AND(E24<>\"\",LEFT(E24,2)=\"GV\"),VLOOKUP(328,Language!A:F,6,FALSE),\"\"))","v":""},null,""]
[null,null,null,{"$f":"IF(E25=\"\",\"\",Customer!E$7)","v":""},null,"","","",null,{"$f":"CONCATENATE(IF(AND(E25<>\"\",OR(I$9=\"\",J$9=\"\")),VLOOKUP(300,TextID,CODE(Language!$B$4)-64,FALSE),\"\"),IF(AND(E25<>\"\",I25=\"\"),VLOOKUP(302,TextID,CODE(Language!$B$4)-64,FALSE),\"\"),IF(AND(E25=\"\",I25<>\"\"),VLOOKUP(306,TextID,CODE(Language!$B$4)-64,FALSE),\"\"),IF(AND(E25<>\"\",E25=E24),VLOOKUP(308,TextID,CODE(Language!$B$4)-64,FALSE),\"\"),IF(AND(E25<>\"\",LEFT(E25,2)=\"GV\"),VLOOKUP(328,Language!A:F,6,FALSE),\"\"))","v":""},null,""]
[null,null,null,{"$f":"IF(E26=\"\",\"\",Customer!E$7)","v":""},null,"","","",null,{"$f":"CONCATENATE(IF(AND(E26<>\"\",OR(I$9=\"\",J$9=\"\")),VLOOKUP(300,TextID,CODE(Language!$B$4)-64,FALSE),\"\"),IF(AND(E26<>\"\",I26=\"\"),VLOOKUP(302,TextID,CODE(Language!$B$4)-64,FALSE),\"\"),IF(AND(E26=\"\",I26<>\"\"),VLOOKUP(306,TextID,CODE(Language!$B$4)-64,FALSE),\"\"),IF(AND(E26<>\"\",E26=E25),VLOOKUP(308,TextID,CODE(Language!$B$4)-64,FALSE),\"\"),IF(AND(E26<>\"\",LEFT(E26,2)=\"GV\"),VLOOKUP(328,Language!A:F,6,FALSE),\"\"))","v":""},null,""]
[null,null,null,{"$f":"IF(E27=\"\",\"\",Customer!E$7)","v":""},null,"","","",null,{"$f":"CONCATENATE(IF(AND(E27<>\"\",OR(I$9=\"\",J$9=\"\")),VLOOKUP(300,TextID,CODE(Language!$B$4)-64,FALSE),\"\"),IF(AND(E27<>\"\",I27=\"\"),VLOOKUP(302,TextID,CODE(Language!$B$4)-64,FALSE),\"\"),IF(AND(E27=\"\",I27<>\"\"),VLOOKUP(306,TextID,CODE(Language!$B$4)-64,FALSE),\"\"),IF(AND(E27<>\"\",E27=E26),VLOOKUP(308,TextID,CODE(Language!$B$4)-64,FALSE),\"\"),IF(AND(E27<>\"\",LEFT(E27,2)=\"GV\"),VLOOKUP(328,Language!A:F,6,FALSE),\"\"))","v":""},null,""]
[null,null,null,{"$f":"IF(E28=\"\",\"\",Customer!E$7)","v":""},null,"","","",null,{"$f":"CONCATENATE(IF(AND(E28<>\"\",OR(I$9=\"\",J$9=\"\")),VLOOKUP(300,TextID,CODE(Language!$B$4)-64,FALSE),\"\"),IF(AND(E28<>\"\",I28=\"\"),VLOOKUP(302,TextID,CODE(Language!$B$4)-64,FALSE),\"\"),IF(AND(E28=\"\",I28<>\"\"),VLOOKUP(306,TextID,CODE(Language!$B$4)-64,FALSE),\"\"),IF(AND(E28<>\"\",E28=E27),VLOOKUP(308,TextID,CODE(Language!$B$4)-64,FALSE),\"\"),IF(AND(E28<>\"\",LEFT(E28,2)=\"GV\"),VLOOKUP(328,Language!A:F,6,FALSE),\"\"))","v":""},null,""]
[null,null,null,{"$f":"IF(E29=\"\",\"\",Customer!E$7)","v":""},null,"","","",null,{"$f":"CONCATENATE(IF(AND(E29<>\"\",OR(I$9=\"\",J$9=\"\")),VLOOKUP(300,TextID,CODE(Language!$B$4)-64,FALSE),\"\"),IF(AND(E29<>\"\",I29=\"\"),VLOOKUP(302,TextID,CODE(Language!$B$4)-64,FALSE),\"\"),IF(AND(E29=\"\",I29<>\"\"),VLOOKUP(306,TextID,CODE(Language!$B$4)-64,FALSE),\"\"),IF(AND(E29<>\"\",E29=E28),VLOOKUP(308,TextID,CODE(Language!$B$4)-64,FALSE),\"\"),IF(AND(E29<>\"\",LEFT(E29,2)=\"GV\"),VLOOKUP(328,Language!A:F,6,FALSE),\"\"))","v":""},null,""]
[null,null,null,{"$f":"IF(E30=\"\",\"\",Customer!E$7)","v":""},null,"","","",null,{"$f":"CONCATENATE(IF(AND(E30<>\"\",OR(I$9=\"\",J$9=\"\")),VLOOKUP(300,TextID,CODE(Language!$B$4)-64,FALSE),\"\"),IF(AND(E30<>\"\",I30=\"\"),VLOOKUP(302,TextID,CODE(Language!$B$4)-64,FALSE),\"\"),IF(AND(E30=\"\",I30<>\"\"),VLOOKUP(306,TextID,CODE(Language!$B$4)-64,FALSE),\"\"),IF(AND(E30<>\"\",E30=E29),VLOOKUP(308,TextID,CODE(Language!$B$4)-64,FALSE),\"\"),IF(AND(E30<>\"\",LEFT(E30,2)=\"GV\"),VLOOKUP(328,Language!A:F,6,FALSE),\"\"))","v":""},null,""]
[null,null,null,{"$f":"IF(E31=\"\",\"\",Customer!E$7)","v":""},null,"","","",null,{"$f":"CONCATENATE(IF(AND(E31<>\"\",OR(I$9=\"\",J$9=\"\")),VLOOKUP(300,TextID,CODE(Language!$B$4)-64,FALSE),\"\"),IF(AND(E31<>\"\",I31=\"\"),VLOOKUP(302,TextID,CODE(Language!$B$4)-64,FALSE),\"\"),IF(AND(E31=\"\",I31<>\"\"),VLOOKUP(306,TextID,CODE(Language!$B$4)-64,FALSE),\"\"),IF(AND(E31<>\"\",E31=E30),VLOOKUP(308,TextID,CODE(Language!$B$4)-64,FALSE),\"\"),IF(AND(E31<>\"\",LEFT(E31,2)=\"GV\"),VLOOKUP(328,Language!A:F,6,FALSE),\"\"))","v":""},null,""]
[null,null,null,{"$f":"IF(E32=\"\",\"\",Customer!E$7)","v":""},null,"","","",null,{"$f":"CONCATENATE(IF(AND(E32<>\"\",OR(I$9=\"\",J$9=\"\")),VLOOKUP(300,TextID,CODE(Language!$B$4)-64,FALSE),\"\"),IF(AND(E32<>\"\",I32=\"\"),VLOOKUP(302,TextID,CODE(Language!$B$4)-64,FALSE),\"\"),IF(AND(E32=\"\",I32<>\"\"),VLOOKUP(306,TextID,CODE(Language!$B$4)-64,FALSE),\"\"),IF(AND(E32<>\"\",E32=E31),VLOOKUP(308,TextID,CODE(Language!$B$4)-64,FALSE),\"\"),IF(AND(E32<>\"\",LEFT(E32,2)=\"GV\"),VLOOKUP(328,Language!A:F,6,FALSE),\"\"))","v":""},null,""]
[null,null,null,{"$f":"IF(E33=\"\",\"\",Customer!E$7)","v":""},null,"","","",null,{"$f":"CONCATENATE(IF(AND(E33<>\"\",OR(I$9=\"\",J$9=\"\")),VLOOKUP(300,TextID,CODE(Language!$B$4)-64,FALSE),\"\"),IF(AND(E33<>\"\",I33=\"\"),VLOOKUP(302,TextID,CODE(Language!$B$4)-64,FALSE),\"\"),IF(AND(E33=\"\",I33<>\"\"),VLOOKUP(306,TextID,CODE(Language!$B$4)-64,FALSE),\"\"),IF(AND(E33<>\"\",E33=E32),VLOOKUP(308,TextID,CODE(Language!$B$4)-64,FALSE),\"\"),IF(AND(E33<>\"\",LEFT(E33,2)=\"GV\"),VLOOKUP(328,Language!A:F,6,FALSE),\"\"))","v":""},null,""]
[null,null,null,{"$f":"IF(E34=\"\",\"\",Customer!E$7)","v":""},null,"","","",null,{"$f":"CONCATENATE(IF(AND(E34<>\"\",OR(I$9=\"\",J$9=\"\")),VLOOKUP(300,TextID,CODE(Language!$B$4)-64,FALSE),\"\"),IF(AND(E34<>\"\",I34=\"\"),VLOOKUP(302,TextID,CODE(Language!$B$4)-64,FALSE),\"\"),IF(AND(E34=\"\",I34<>\"\"),VLOOKUP(306,TextID,CODE(Language!$B$4)-64,FALSE),\"\"),IF(AND(E34<>\"\",E34=E33),VLOOKUP(308,TextID,CODE(Language!$B$4)-64,FALSE),\"\"),IF(AND(E34<>\"\",LEFT(E34,2)=\"GV\"),VLOOKUP(328,Language!A:F,6,FALSE),\"\"))","v":""},null,""]
[null,null,null,{"$f":"IF(E35=\"\",\"\",Customer!E$7)","v":""},null,"","","",null,{"$f":"CONCATENATE(IF(AND(E35<>\"\",OR(I$9=\"\",J$9=\"\")),VLOOKUP(300,TextID,CODE(Language!$B$4)-64,FALSE),\"\"),IF(AND(E35<>\"\",I35=\"\"),VLOOKUP(302,TextID,CODE(Language!$B$4)-64,FALSE),\"\"),IF(AND(E35=\"\",I35<>\"\"),VLOOKUP(306,TextID,CODE(Language!$B$4)-64,FALSE),\"\"),IF(AND(E35<>\"\",E35=E34),VLOOKUP(308,TextID,CODE(Language!$B$4)-64,FALSE),\"\"),IF(AND(E35<>\"\",LEFT(E35,2)=\"GV\"),VLOOKUP(328,Language!A:F,6,FALSE),\"\"))","v":""},null,""]
[null,null,null,{"$f":"IF(E36=\"\",\"\",Customer!E$7)","v":""},null,"","","",null,{"$f":"CONCATENATE(IF(AND(E36<>\"\",OR(I$9=\"\",J$9=\"\")),VLOOKUP(300,TextID,CODE(Language!$B$4)-64,FALSE),\"\"),IF(AND(E36<>\"\",I36=\"\"),VLOOKUP(302,TextID,CODE(Language!$B$4)-64,FALSE),\"\"),IF(AND(E36=\"\",I36<>\"\"),VLOOKUP(306,TextID,CODE(Language!$B$4)-64,FALSE),\"\"),IF(AND(E36<>\"\",E36=E35),VLOOKUP(308,TextID,CODE(Language!$B$4)-64,FALSE),\"\"),IF(AND(E36<>\"\",LEFT(E36,2)=\"GV\"),VLOOKUP(328,Language!A:F,6,FALSE),\"\"))","v":""},null,""]
[null,null,null,{"$f":"IF(E37=\"\",\"\",Customer!E$7)","v":""},null,"","","",null,{"$f":"CONCATENATE(IF(AND(E37<>\"\",OR(I$9=\"\",J$9=\"\")),VLOOKUP(300,TextID,CODE(Language!$B$4)-64,FALSE),\"\"),IF(AND(E37<>\"\",I37=\"\"),VLOOKUP(302,TextID,CODE(Language!$B$4)-64,FALSE),\"\"),IF(AND(E37=\"\",I37<>\"\"),VLOOKUP(306,TextID,CODE(Language!$B$4)-64,FALSE),\"\"),IF(AND(E37<>\"\",E37=E36),VLOOKUP(308,TextID,CODE(Language!$B$4)-64,FALSE),\"\"),IF(AND(E37<>\"\",LEFT(E37,2)=\"GV\"),VLOOKUP(328,Language!A:F,6,FALSE),\"\"))","v":""},null,""]
[null,null,null,{"$f":"IF(E38=\"\",\"\",Customer!E$7)","v":""},null,"","","",null,{"$f":"CONCATENATE(IF(AND(E38<>\"\",OR(I$9=\"\",J$9=\"\")),VLOOKUP(300,TextID,CODE(Language!$B$4)-64,FALSE),\"\"),IF(AND(E38<>\"\",I38=\"\"),VLOOKUP(302,TextID,CODE(Language!$B$4)-64,FALSE),\"\"),IF(AND(E38=\"\",I38<>\"\"),VLOOKUP(306,TextID,CODE(Language!$B$4)-64,FALSE),\"\"),IF(AND(E38<>\"\",E38=E37),VLOOKUP(308,TextID,CODE(Language!$B$4)-64,FALSE),\"\"),IF(AND(E38<>\"\",LEFT(E38,2)=\"GV\"),VLOOKUP(328,Language!A:F,6,FALSE),\"\"))","v":""},null,""]
[null,null,null,{"$f":"IF(E39=\"\",\"\",Customer!E$7)","v":""},null,"","","",null,{"$f":"CONCATENATE(IF(AND(E39<>\"\",OR(I$9=\"\",J$9=\"\")),VLOOKUP(300,TextID,CODE(Language!$B$4)-64,FALSE),\"\"),IF(AND(E39<>\"\",I39=\"\"),VLOOKUP(302,TextID,CODE(Language!$B$4)-64,FALSE),\"\"),IF(AND(E39=\"\",I39<>\"\"),VLOOKUP(306,TextID,CODE(Language!$B$4)-64,FALSE),\"\"),IF(AND(E39<>\"\",E39=E38),VLOOKUP(308,TextID,CODE(Language!$B$4)-64,FALSE),\"\"),IF(AND(E39<>\"\",LEFT(E39,2)=\"GV\"),VLOOKUP(328,Language!A:F,6,FALSE),\"\"))","v":""},null,""]
[null,null,null,{"$f":"IF(E40=\"\",\"\",Customer!E$7)","v":""},null,"","","",null,{"$f":"CONCATENATE(IF(AND(E40<>\"\",OR(I$9=\"\",J$9=\"\")),VLOOKUP(300,TextID,CODE(Language!$B$4)-64,FALSE),\"\"),IF(AND(E40<>\"\",I40=\"\"),VLOOKUP(302,TextID,CODE(Language!$B$4)-64,FALSE),\"\"),IF(AND(E40=\"\",I40<>\"\"),VLOOKUP(306,TextID,CODE(Language!$B$4)-64,FALSE),\"\"),IF(AND(E40<>\"\",E40=E39),VLOOKUP(308,TextID,CODE(Language!$B$4)-64,FALSE),\"\"),IF(AND(E40<>\"\",LEFT(E40,2)=\"GV\"),VLOOKUP(328,Language!A:F,6,FALSE),\"\"))","v":""},null,""]
[null,null,null,{"$f":"IF(E41=\"\",\"\",Customer!E$7)","v":""},null,"","","",null,{"$f":"CONCATENATE(IF(AND(E41<>\"\",OR(I$9=\"\",J$9=\"\")),VLOOKUP(300,TextID,CODE(Language!$B$4)-64,FALSE),\"\"),IF(AND(E41<>\"\",I41=\"\"),VLOOKUP(302,TextID,CODE(Language!$B$4)-64,FALSE),\"\"),IF(AND(E41=\"\",I41<>\"\"),VLOOKUP(306,TextID,CODE(Language!$B$4)-64,FALSE),\"\"),IF(AND(E41<>\"\",E41=E40),VLOOKUP(308,TextID,CODE(Language!$B$4)-64,FALSE),\"\"),IF(AND(E41<>\"\",LEFT(E41,2)=\"GV\"),VLOOKUP(328,Language!A:F,6,FALSE),\"\"))","v":""},null,""]
[null,null,null,{"$f":"IF(E42=\"\",\"\",Customer!E$7)","v":""},null,"","","",null,{"$f":"CONCATENATE(IF(AND(E42<>\"\",OR(I$9=\"\",J$9=\"\")),VLOOKUP(300,TextID,CODE(Language!$B$4)-64,FALSE),\"\"),IF(AND(E42<>\"\",I42=\"\"),VLOOKUP(302,TextID,CODE(Language!$B$4)-64,FALSE),\"\"),IF(AND(E42=\"\",I42<>\"\"),VLOOKUP(306,TextID,CODE(Language!$B$4)-64,FALSE),\"\"),IF(AND(E42<>\"\",E42=E41),VLOOKUP(308,TextID,CODE(Language!$B$4)-64,FALSE),\"\"),IF(AND(E42<>\"\",LEFT(E42,2)=\"GV\"),VLOOKUP(328,Language!A:F,6,FALSE),\"\"))","v":""},null,""]
[null,null,null,{"$f":"IF(E43=\"\",\"\",Customer!E$7)","v":""},null,"","","",null,{"$f":"CONCATENATE(IF(AND(E43<>\"\",OR(I$9=\"\",J$9=\"\")),VLOOKUP(300,TextID,CODE(Language!$B$4)-64,FALSE),\"\"),IF(AND(E43<>\"\",I43=\"\"),VLOOKUP(302,TextID,CODE(Language!$B$4)-64,FALSE),\"\"),IF(AND(E43=\"\",I43<>\"\"),VLOOKUP(306,TextID,CODE(Language!$B$4)-64,FALSE),\"\"),IF(AND(E43<>\"\",E43=E42),VLOOKUP(308,TextID,CODE(Language!$B$4)-64,FALSE),\"\"),IF(AND(E43<>\"\",LEFT(E43,2)=\"GV\"),VLOOKUP(328,Language!A:F,6,FALSE),\"\"))","v":""},null,""]
[null,null,null,{"$f":"IF(E44=\"\",\"\",Customer!E$7)","v":""},null,"","","",null,{"$f":"CONCATENATE(IF(AND(E44<>\"\",OR(I$9=\"\",J$9=\"\")),VLOOKUP(300,TextID,CODE(Language!$B$4)-64,FALSE),\"\"),IF(AND(E44<>\"\",I44=\"\"),VLOOKUP(302,TextID,CODE(Language!$B$4)-64,FALSE),\"\"),IF(AND(E44=\"\",I44<>\"\"),VLOOKUP(306,TextID,CODE(Language!$B$4)-64,FALSE),\"\"),IF(AND(E44<>\"\",E44=E43),VLOOKUP(308,TextID,CODE(Language!$B$4)-64,FALSE),\"\"),IF(AND(E44<>\"\",LEFT(E44,2)=\"GV\"),VLOOKUP(328,Language!A:F,6,FALSE),\"\"))","v":""},null,""]
[null,null,null,{"$f":"IF(E45=\"\",\"\",Customer!E$7)","v":""},null,"",{"$f":"IF($E45=\"\",\"\",VLOOKUP($E45,Material1b,3))","v":""},{"$f":"IF(E45=\"\",\"\",I$9)","v":""},null,{"$f":"CONCATENATE(IF(AND(E45<>\"\",OR(I$9=\"\",J$9=\"\")),VLOOKUP(300,TextID,CODE(Language!$B$4)-64,FALSE),\"\"),IF(AND(E45<>\"\",I45=\"\"),VLOOKUP(302,TextID,CODE(Language!$B$4)-64,FALSE),\"\"),IF(AND(E45=\"\",I45<>\"\"),VLOOKUP(306,TextID,CODE(Language!$B$4)-64,FALSE),\"\"),IF(AND(E45<>\"\",E45=E44),VLOOKUP(308,TextID,CODE(Language!$B$4)-64,FALSE),\"\"),IF(AND(E45<>\"\",LEFT(E45,2)=\"GV\"),VLOOKUP(328,Language!A:F,6,FALSE),\"\"))","v":""},null,""]
[null,null,null,{"$f":"IF(E46=\"\",\"\",Customer!E$7)","v":""},null,{"$f":"IF($E46=\"\",\"\",VLOOKUP($E46,Material1b,2))","v":""},"","",null,{"$f":"CONCATENATE(IF(AND(E46<>\"\",OR(I$9=\"\",J$9=\"\")),VLOOKUP(300,TextID,CODE(Language!$B$4)-64,FALSE),\"\"),IF(AND(E46<>\"\",I46=\"\"),VLOOKUP(302,TextID,CODE(Language!$B$4)-64,FALSE),\"\"),IF(AND(E46=\"\",I46<>\"\"),VLOOKUP(306,TextID,CODE(Language!$B$4)-64,FALSE),\"\"),IF(AND(E46<>\"\",E46=E45),VLOOKUP(308,TextID,CODE(Language!$B$4)-64,FALSE),\"\"),IF(AND(E46<>\"\",LEFT(E46,2)=\"GV\"),VLOOKUP(328,Language!A:F,6,FALSE),\"\"))","v":""},null,""]
[null,null,null,{"$f":"IF(E47=\"\",\"\",Customer!E$7)","v":""},null,"","","",null,{"$f":"CONCATENATE(IF(AND(E47<>\"\",OR(I$9=\"\",J$9=\"\")),VLOOKUP(300,TextID,CODE(Language!$B$4)-64,FALSE),\"\"),IF(AND(E47<>\"\",I47=\"\"),VLOOKUP(302,TextID,CODE(Language!$B$4)-64,FALSE),\"\"),IF(AND(E47=\"\",I47<>\"\"),VLOOKUP(306,TextID,CODE(Language!$B$4)-64,FALSE),\"\"),IF(AND(E47<>\"\",E47=E46),VLOOKUP(308,TextID,CODE(Language!$B$4)-64,FALSE),\"\"),IF(AND(E47<>\"\",LEFT(E47,2)=\"GV\"),VLOOKUP(328,Language!A:F,6,FALSE),\"\"))","v":""},null,""]
[null,null,null,{"$f":"IF(E48=\"\",\"\",Customer!E$7)","v":""},null,"","","",null,{"$f":"CONCATENATE(IF(AND(E48<>\"\",OR(I$9=\"\",J$9=\"\")),VLOOKUP(300,TextID,CODE(Language!$B$4)-64,FALSE),\"\"),IF(AND(E48<>\"\",I48=\"\"),VLOOKUP(302,TextID,CODE(Language!$B$4)-64,FALSE),\"\"),IF(AND(E48=\"\",I48<>\"\"),VLOOKUP(306,TextID,CODE(Language!$B$4)-64,FALSE),\"\"),IF(AND(E48<>\"\",E48=E47),VLOOKUP(308,TextID,CODE(Language!$B$4)-64,FALSE),\"\"),IF(AND(E48<>\"\",LEFT(E48,2)=\"GV\"),VLOOKUP(328,Language!A:F,6,FALSE),\"\"))","v":""},null,""]
[null,null,null,{"$f":"IF(E49=\"\",\"\",Customer!E$7)","v":""},null,"","","",null,{"$f":"CONCATENATE(IF(AND(E49<>\"\",OR(I$9=\"\",J$9=\"\")),VLOOKUP(300,TextID,CODE(Language!$B$4)-64,FALSE),\"\"),IF(AND(E49<>\"\",I49=\"\"),VLOOKUP(302,TextID,CODE(Language!$B$4)-64,FALSE),\"\"),IF(AND(E49=\"\",I49<>\"\"),VLOOKUP(306,TextID,CODE(Language!$B$4)-64,FALSE),\"\"),IF(AND(E49<>\"\",E49=E48),VLOOKUP(308,TextID,CODE(Language!$B$4)-64,FALSE),\"\"),IF(AND(E49<>\"\",LEFT(E49,2)=\"GV\"),VLOOKUP(328,Language!A:F,6,FALSE),\"\"))","v":""},null,""]
[null,null,null,{"$f":"IF(E50=\"\",\"\",Customer!E$7)","v":""},null,"","","",null,{"$f":"CONCATENATE(IF(AND(E50<>\"\",OR(I$9=\"\",J$9=\"\")),VLOOKUP(300,TextID,CODE(Language!$B$4)-64,FALSE),\"\"),IF(AND(E50<>\"\",I50=\"\"),VLOOKUP(302,TextID,CODE(Language!$B$4)-64,FALSE),\"\"),IF(AND(E50=\"\",I50<>\"\"),VLOOKUP(306,TextID,CODE(Language!$B$4)-64,FALSE),\"\"),IF(AND(E50<>\"\",E50=E49),VLOOKUP(308,TextID,CODE(Language!$B$4)-64,FALSE),\"\"),IF(AND(E50<>\"\",LEFT(E50,2)=\"GV\"),VLOOKUP(328,Language!A:F,6,FALSE),\"\"))","v":""},null,""]
[null,null,null,{"$f":"IF(E51=\"\",\"\",Customer!E$7)","v":""},null,"","","",null,{"$f":"CONCATENATE(IF(AND(E51<>\"\",OR(I$9=\"\",J$9=\"\")),VLOOKUP(300,TextID,CODE(Language!$B$4)-64,FALSE),\"\"),IF(AND(E51<>\"\",I51=\"\"),VLOOKUP(302,TextID,CODE(Language!$B$4)-64,FALSE),\"\"),IF(AND(E51=\"\",I51<>\"\"),VLOOKUP(306,TextID,CODE(Language!$B$4)-64,FALSE),\"\"),IF(AND(E51<>\"\",E51=E50),VLOOKUP(308,TextID,CODE(Language!$B$4)-64,FALSE),\"\"),IF(AND(E51<>\"\",LEFT(E51,2)=\"GV\"),VLOOKUP(328,Language!A:F,6,FALSE),\"\"))","v":""},null,""]
[null,null,null,{"$f":"IF(E52=\"\",\"\",Customer!E$7)","v":""},null,"","","",null,{"$f":"CONCATENATE(IF(AND(E52<>\"\",OR(I$9=\"\",J$9=\"\")),VLOOKUP(300,TextID,CODE(Language!$B$4)-64,FALSE),\"\"),IF(AND(E52<>\"\",I52=\"\"),VLOOKUP(302,TextID,CODE(Language!$B$4)-64,FALSE),\"\"),IF(AND(E52=\"\",I52<>\"\"),VLOOKUP(306,TextID,CODE(Language!$B$4)-64,FALSE),\"\"),IF(AND(E52<>\"\",E52=E51),VLOOKUP(308,TextID,CODE(Language!$B$4)-64,FALSE),\"\"),IF(AND(E52<>\"\",LEFT(E52,2)=\"GV\"),VLOOKUP(328,Language!A:F,6,FALSE),\"\"))","v":""},null,""]
[null,null,null,{"$f":"IF(E53=\"\",\"\",Customer!E$7)","v":""},null,"","","",null,{"$f":"CONCATENATE(IF(AND(E53<>\"\",OR(I$9=\"\",J$9=\"\")),VLOOKUP(300,TextID,CODE(Language!$B$4)-64,FALSE),\"\"),IF(AND(E53<>\"\",I53=\"\"),VLOOKUP(302,TextID,CODE(Language!$B$4)-64,FALSE),\"\"),IF(AND(E53=\"\",I53<>\"\"),VLOOKUP(306,TextID,CODE(Language!$B$4)-64,FALSE),\"\"),IF(AND(E53<>\"\",E53=E52),VLOOKUP(308,TextID,CODE(Language!$B$4)-64,FALSE),\"\"),IF(AND(E53<>\"\",LEFT(E53,2)=\"GV\"),VLOOKUP(328,Language!A:F,6,FALSE),\"\"))","v":""},null,""]
[null,null,null,{"$f":"IF(E54=\"\",\"\",Customer!E$7)","v":""},null,"","","",null,{"$f":"CONCATENATE(IF(AND(E54<>\"\",OR(I$9=\"\",J$9=\"\")),VLOOKUP(300,TextID,CODE(Language!$B$4)-64,FALSE),\"\"),IF(AND(E54<>\"\",I54=\"\"),VLOOKUP(302,TextID,CODE(Language!$B$4)-64,FALSE),\"\"),IF(AND(E54=\"\",I54<>\"\"),VLOOKUP(306,TextID,CODE(Language!$B$4)-64,FALSE),\"\"),IF(AND(E54<>\"\",E54=E53),VLOOKUP(308,TextID,CODE(Language!$B$4)-64,FALSE),\"\"),IF(AND(E54<>\"\",LEFT(E54,2)=\"GV\"),VLOOKUP(328,Language!A:F,6,FALSE),\"\"))","v":""},null,""]
[null,null,null,{"$f":"IF(E55=\"\",\"\",Customer!E$7)","v":""},null,"","","",null,{"$f":"CONCATENATE(IF(AND(E55<>\"\",OR(I$9=\"\",J$9=\"\")),VLOOKUP(300,TextID,CODE(Language!$B$4)-64,FALSE),\"\"),IF(AND(E55<>\"\",I55=\"\"),VLOOKUP(302,TextID,CODE(Language!$B$4)-64,FALSE),\"\"),IF(AND(E55=\"\",I55<>\"\"),VLOOKUP(306,TextID,CODE(Language!$B$4)-64,FALSE),\"\"),IF(AND(E55<>\"\",E55=E54),VLOOKUP(308,TextID,CODE(Language!$B$4)-64,FALSE),\"\"),IF(AND(E55<>\"\",LEFT(E55,2)=\"GV\"),VLOOKUP(328,Language!A:F,6,FALSE),\"\"))","v":""},null,""]
[null,null,null,{"$f":"IF(E56=\"\",\"\",Customer!E$7)","v":""},null,"","","",null,{"$f":"CONCATENATE(IF(AND(E56<>\"\",OR(I$9=\"\",J$9=\"\")),VLOOKUP(300,TextID,CODE(Language!$B$4)-64,FALSE),\"\"),IF(AND(E56<>\"\",I56=\"\"),VLOOKUP(302,TextID,CODE(Language!$B$4)-64,FALSE),\"\"),IF(AND(E56=\"\",I56<>\"\"),VLOOKUP(306,TextID,CODE(Language!$B$4)-64,FALSE),\"\"),IF(AND(E56<>\"\",E56=E55),VLOOKUP(308,TextID,CODE(Language!$B$4)-64,FALSE),\"\"),IF(AND(E56<>\"\",LEFT(E56,2)=\"GV\"),VLOOKUP(328,Language!A:F,6,FALSE),\"\"))","v":""},null,""]
[null,null,null,{"$f":"IF(E57=\"\",\"\",Customer!E$7)","v":""},null,"","","",null,{"$f":"CONCATENATE(IF(AND(E57<>\"\",OR(I$9=\"\",J$9=\"\")),VLOOKUP(300,TextID,CODE(Language!$B$4)-64,FALSE),\"\"),IF(AND(E57<>\"\",I57=\"\"),VLOOKUP(302,TextID,CODE(Language!$B$4)-64,FALSE),\"\"),IF(AND(E57=\"\",I57<>\"\"),VLOOKUP(306,TextID,CODE(Language!$B$4)-64,FALSE),\"\"),IF(AND(E57<>\"\",E57=E56),VLOOKUP(308,TextID,CODE(Language!$B$4)-64,FALSE),\"\"),IF(AND(E57<>\"\",LEFT(E57,2)=\"GV\"),VLOOKUP(328,Language!A:F,6,FALSE),\"\"))","v":""},null,""]
[null,null,null,{"$f":"IF(E58=\"\",\"\",Customer!E$7)","v":""},null,"","","",null,{"$f":"CONCATENATE(IF(AND(E58<>\"\",OR(I$9=\"\",J$9=\"\")),VLOOKUP(300,TextID,CODE(Language!$B$4)-64,FALSE),\"\"),IF(AND(E58<>\"\",I58=\"\"),VLOOKUP(302,TextID,CODE(Language!$B$4)-64,FALSE),\"\"),IF(AND(E58=\"\",I58<>\"\"),VLOOKUP(306,TextID,CODE(Language!$B$4)-64,FALSE),\"\"),IF(AND(E58<>\"\",E58=E57),VLOOKUP(308,TextID,CODE(Language!$B$4)-64,FALSE),\"\"),IF(AND(E58<>\"\",LEFT(E58,2)=\"GV\"),VLOOKUP(328,Language!A:F,6,FALSE),\"\"))","v":""},null,""]
[null,null,null,{"$f":"IF(E59=\"\",\"\",Customer!E$7)","v":""},null,"","","",null,{"$f":"CONCATENATE(IF(AND(E59<>\"\",OR(I$9=\"\",J$9=\"\")),VLOOKUP(300,TextID,CODE(Language!$B$4)-64,FALSE),\"\"),IF(AND(E59<>\"\",I59=\"\"),VLOOKUP(302,TextID,CODE(Language!$B$4)-64,FALSE),\"\"),IF(AND(E59=\"\",I59<>\"\"),VLOOKUP(306,TextID,CODE(Language!$B$4)-64,FALSE),\"\"),IF(AND(E59<>\"\",E59=E58),VLOOKUP(308,TextID,CODE(Language!$B$4)-64,FALSE),\"\"),IF(AND(E59<>\"\",LEFT(E59,2)=\"GV\"),VLOOKUP(328,Language!A:F,6,FALSE),\"\"))","v":""},null,""]
[null,null,null,{"$f":"IF(E60=\"\",\"\",Customer!E$7)","v":""},null,"","","",null,{"$f":"CONCATENATE(IF(AND(E60<>\"\",OR(I$9=\"\",J$9=\"\")),VLOOKUP(300,TextID,CODE(Language!$B$4)-64,FALSE),\"\"),IF(AND(E60<>\"\",I60=\"\"),VLOOKUP(302,TextID,CODE(Language!$B$4)-64,FALSE),\"\"),IF(AND(E60=\"\",I60<>\"\"),VLOOKUP(306,TextID,CODE(Language!$B$4)-64,FALSE),\"\"),IF(AND(E60<>\"\",E60=E59),VLOOKUP(308,TextID,CODE(Language!$B$4)-64,FALSE),\"\"),IF(AND(E60<>\"\",LEFT(E60,2)=\"GV\"),VLOOKUP(328,Language!A:F,6,FALSE),\"\"))","v":""},null,""]
[null,null,null,{"$f":"IF(E61=\"\",\"\",Customer!E$7)","v":""},null,"","","",null,{"$f":"CONCATENATE(IF(AND(E61<>\"\",OR(I$9=\"\",J$9=\"\")),VLOOKUP(300,TextID,CODE(Language!$B$4)-64,FALSE),\"\"),IF(AND(E61<>\"\",I61=\"\"),VLOOKUP(302,TextID,CODE(Language!$B$4)-64,FALSE),\"\"),IF(AND(E61=\"\",I61<>\"\"),VLOOKUP(306,TextID,CODE(Language!$B$4)-64,FALSE),\"\"),IF(AND(E61<>\"\",E61=E60),VLOOKUP(308,TextID,CODE(Language!$B$4)-64,FALSE),\"\"),IF(AND(E61<>\"\",LEFT(E61,2)=\"GV\"),VLOOKUP(328,Language!A:F,6,FALSE),\"\"))","v":""},null,""]
[null,null,null,{"$f":"IF(E62=\"\",\"\",Customer!E$7)","v":""},null,"","","",null,{"$f":"CONCATENATE(IF(AND(E62<>\"\",OR(I$9=\"\",J$9=\"\")),VLOOKUP(300,TextID,CODE(Language!$B$4)-64,FALSE),\"\"),IF(AND(E62<>\"\",I62=\"\"),VLOOKUP(302,TextID,CODE(Language!$B$4)-64,FALSE),\"\"),IF(AND(E62=\"\",I62<>\"\"),VLOOKUP(306,TextID,CODE(Language!$B$4)-64,FALSE),\"\"),IF(AND(E62<>\"\",E62=E61),VLOOKUP(308,TextID,CODE(Language!$B$4)-64,FALSE),\"\"),IF(AND(E62<>\"\",LEFT(E62,2)=\"GV\"),VLOOKUP(328,Language!A:F,6,FALSE),\"\"))","v":""},null,""]
[null,null,null,{"$f":"IF(E63=\"\",\"\",Customer!E$7)","v":""},null,"","","",null,{"$f":"CONCATENATE(IF(AND(E63<>\"\",OR(I$9=\"\",J$9=\"\")),VLOOKUP(300,TextID,CODE(Language!$B$4)-64,FALSE),\"\"),IF(AND(E63<>\"\",I63=\"\"),VLOOKUP(302,TextID,CODE(Language!$B$4)-64,FALSE),\"\"),IF(AND(E63=\"\",I63<>\"\"),VLOOKUP(306,TextID,CODE(Language!$B$4)-64,FALSE),\"\"),IF(AND(E63<>\"\",E63=E62),VLOOKUP(308,TextID,CODE(Language!$B$4)-64,FALSE),\"\"),IF(AND(E63<>\"\",LEFT(E63,2)=\"GV\"),VLOOKUP(328,Language!A:F,6,FALSE),\"\"))","v":""},null,""]
[null,null,null,{"$f":"IF(E64=\"\",\"\",Customer!E$7)","v":""},null,"","","",null,{"$f":"CONCATENATE(IF(AND(E64<>\"\",OR(I$9=\"\",J$9=\"\")),VLOOKUP(300,TextID,CODE(Language!$B$4)-64,FALSE),\"\"),IF(AND(E64<>\"\",I64=\"\"),VLOOKUP(302,TextID,CODE(Language!$B$4)-64,FALSE),\"\"),IF(AND(E64=\"\",I64<>\"\"),VLOOKUP(306,TextID,CODE(Language!$B$4)-64,FALSE),\"\"),IF(AND(E64<>\"\",E64=E63),VLOOKUP(308,TextID,CODE(Language!$B$4)-64,FALSE),\"\"),IF(AND(E64<>\"\",LEFT(E64,2)=\"GV\"),VLOOKUP(328,Language!A:F,6,FALSE),\"\"))","v":""},null,""]
[null,null,null,{"$f":"IF(E65=\"\",\"\",Customer!E$7)","v":""},null,"","","",null,{"$f":"CONCATENATE(IF(AND(E65<>\"\",OR(I$9=\"\",J$9=\"\")),VLOOKUP(300,TextID,CODE(Language!$B$4)-64,FALSE),\"\"),IF(AND(E65<>\"\",I65=\"\"),VLOOKUP(302,TextID,CODE(Language!$B$4)-64,FALSE),\"\"),IF(AND(E65=\"\",I65<>\"\"),VLOOKUP(306,TextID,CODE(Language!$B$4)-64,FALSE),\"\"),IF(AND(E65<>\"\",E65=E64),VLOOKUP(308,TextID,CODE(Language!$B$4)-64,FALSE),\"\"),IF(AND(E65<>\"\",LEFT(E65,2)=\"GV\"),VLOOKUP(328,Language!A:F,6,FALSE),\"\"))","v":""},null,""]
[null,null,null,{"$f":"IF(E66=\"\",\"\",Customer!E$7)","v":""},null,"","","",null,{"$f":"CONCATENATE(IF(AND(E66<>\"\",OR(I$9=\"\",J$9=\"\")),VLOOKUP(300,TextID,CODE(Language!$B$4)-64,FALSE),\"\"),IF(AND(E66<>\"\",I66=\"\"),VLOOKUP(302,TextID,CODE(Language!$B$4)-64,FALSE),\"\"),IF(AND(E66=\"\",I66<>\"\"),VLOOKUP(306,TextID,CODE(Language!$B$4)-64,FALSE),\"\"),IF(AND(E66<>\"\",E66=E65),VLOOKUP(308,TextID,CODE(Language!$B$4)-64,FALSE),\"\"),IF(AND(E66<>\"\",LEFT(E66,2)=\"GV\"),VLOOKUP(328,Language!A:F,6,FALSE),\"\"))","v":""},null,""]
[null,null,null,{"$f":"IF(E67=\"\",\"\",Customer!E$7)","v":""},null,"","","",null,{"$f":"CONCATENATE(IF(AND(E67<>\"\",OR(I$9=\"\",J$9=\"\")),VLOOKUP(300,TextID,CODE(Language!$B$4)-64,FALSE),\"\"),IF(AND(E67<>\"\",I67=\"\"),VLOOKUP(302,TextID,CODE(Language!$B$4)-64,FALSE),\"\"),IF(AND(E67=\"\",I67<>\"\"),VLOOKUP(306,TextID,CODE(Language!$B$4)-64,FALSE),\"\"),IF(AND(E67<>\"\",E67=E66),VLOOKUP(308,TextID,CODE(Language!$B$4)-64,FALSE),\"\"),IF(AND(E67<>\"\",LEFT(E67,2)=\"GV\"),VLOOKUP(328,Language!A:F,6,FALSE),\"\"))","v":""},null,""]
[null,null,null,{"$f":"IF(E68=\"\",\"\",Customer!E$7)","v":""},null,"","","",null,{"$f":"CONCATENATE(IF(AND(E68<>\"\",OR(I$9=\"\",J$9=\"\")),VLOOKUP(300,TextID,CODE(Language!$B$4)-64,FALSE),\"\"),IF(AND(E68<>\"\",I68=\"\"),VLOOKUP(302,TextID,CODE(Language!$B$4)-64,FALSE),\"\"),IF(AND(E68=\"\",I68<>\"\"),VLOOKUP(306,TextID,CODE(Language!$B$4)-64,FALSE),\"\"),IF(AND(E68<>\"\",E68=E67),VLOOKUP(308,TextID,CODE(Language!$B$4)-64,FALSE),\"\"),IF(AND(E68<>\"\",LEFT(E68,2)=\"GV\"),VLOOKUP(328,Language!A:F,6,FALSE),\"\"))","v":""},null,""]
[null,null,null,{"$f":"IF(E69=\"\",\"\",Customer!E$7)","v":""},null,"","","",null,{"$f":"CONCATENATE(IF(AND(E69<>\"\",OR(I$9=\"\",J$9=\"\")),VLOOKUP(300,TextID,CODE(Language!$B$4)-64,FALSE),\"\"),IF(AND(E69<>\"\",I69=\"\"),VLOOKUP(302,TextID,CODE(Language!$B$4)-64,FALSE),\"\"),IF(AND(E69=\"\",I69<>\"\"),VLOOKUP(306,TextID,CODE(Language!$B$4)-64,FALSE),\"\"),IF(AND(E69<>\"\",E69=E68),VLOOKUP(308,TextID,CODE(Language!$B$4)-64,FALSE),\"\"),IF(AND(E69<>\"\",LEFT(E69,2)=\"GV\"),VLOOKUP(328,Language!A:F,6,FALSE),\"\"))","v":""},null,""]
[null,null,null,{"$f":"IF(E70=\"\",\"\",Customer!E$7)","v":""},null,"","","",null,{"$f":"CONCATENATE(IF(AND(E70<>\"\",OR(I$9=\"\",J$9=\"\")),VLOOKUP(300,TextID,CODE(Language!$B$4)-64,FALSE),\"\"),IF(AND(E70<>\"\",I70=\"\"),VLOOKUP(302,TextID,CODE(Language!$B$4)-64,FALSE),\"\"),IF(AND(E70=\"\",I70<>\"\"),VLOOKUP(306,TextID,CODE(Language!$B$4)-64,FALSE),\"\"),IF(AND(E70<>\"\",E70=E69),VLOOKUP(308,TextID,CODE(Language!$B$4)-64,FALSE),\"\"),IF(AND(E70<>\"\",LEFT(E70,2)=\"GV\"),VLOOKUP(328,Language!A:F,6,FALSE),\"\"))","v":""},null,""]
[null,null,null,{"$f":"IF(E71=\"\",\"\",Customer!E$7)","v":""},null,"","","",null,{"$f":"CONCATENATE(IF(AND(E71<>\"\",OR(I$9=\"\",J$9=\"\")),VLOOKUP(300,TextID,CODE(Language!$B$4)-64,FALSE),\"\"),IF(AND(E71<>\"\",I71=\"\"),VLOOKUP(302,TextID,CODE(Language!$B$4)-64,FALSE),\"\"),IF(AND(E71=\"\",I71<>\"\"),VLOOKUP(306,TextID,CODE(Language!$B$4)-64,FALSE),\"\"),IF(AND(E71<>\"\",E71=E70),VLOOKUP(308,TextID,CODE(Language!$B$4)-64,FALSE),\"\"),IF(AND(E71<>\"\",LEFT(E71,2)=\"GV\"),VLOOKUP(328,Language!A:F,6,FALSE),\"\"))","v":""},null,""]
[null,null,null,{"$f":"IF(E72=\"\",\"\",Customer!E$7)","v":""},null,"","","",null,{"$f":"CONCATENATE(IF(AND(E72<>\"\",OR(I$9=\"\",J$9=\"\")),VLOOKUP(300,TextID,CODE(Language!$B$4)-64,FALSE),\"\"),IF(AND(E72<>\"\",I72=\"\"),VLOOKUP(302,TextID,CODE(Language!$B$4)-64,FALSE),\"\"),IF(AND(E72=\"\",I72<>\"\"),VLOOKUP(306,TextID,CODE(Language!$B$4)-64,FALSE),\"\"),IF(AND(E72<>\"\",E72=E71),VLOOKUP(308,TextID,CODE(Language!$B$4)-64,FALSE),\"\"),IF(AND(E72<>\"\",LEFT(E72,2)=\"GV\"),VLOOKUP(328,Language!A:F,6,FALSE),\"\"))","v":""},null,""]
[null,null,null,{"$f":"IF(E73=\"\",\"\",Customer!E$7)","v":""},null,"","","",null,{"$f":"CONCATENATE(IF(AND(E73<>\"\",OR(I$9=\"\",J$9=\"\")),VLOOKUP(300,TextID,CODE(Language!$B$4)-64,FALSE),\"\"),IF(AND(E73<>\"\",I73=\"\"),VLOOKUP(302,TextID,CODE(Language!$B$4)-64,FALSE),\"\"),IF(AND(E73=\"\",I73<>\"\"),VLOOKUP(306,TextID,CODE(Language!$B$4)-64,FALSE),\"\"),IF(AND(E73<>\"\",E73=E72),VLOOKUP(308,TextID,CODE(Language!$B$4)-64,FALSE),\"\"),IF(AND(E73<>\"\",LEFT(E73,2)=\"GV\"),VLOOKUP(328,Language!A:F,6,FALSE),\"\"))","v":""},null,""]
[null,null,null,{"$f":"IF(E74=\"\",\"\",Customer!E$7)","v":""},null,"","","",null,{"$f":"CONCATENATE(IF(AND(E74<>\"\",OR(I$9=\"\",J$9=\"\")),VLOOKUP(300,TextID,CODE(Language!$B$4)-64,FALSE),\"\"),IF(AND(E74<>\"\",I74=\"\"),VLOOKUP(302,TextID,CODE(Language!$B$4)-64,FALSE),\"\"),IF(AND(E74=\"\",I74<>\"\"),VLOOKUP(306,TextID,CODE(Language!$B$4)-64,FALSE),\"\"),IF(AND(E74<>\"\",E74=E73),VLOOKUP(308,TextID,CODE(Language!$B$4)-64,FALSE),\"\"),IF(AND(E74<>\"\",LEFT(E74,2)=\"GV\"),VLOOKUP(328,Language!A:F,6,FALSE),\"\"))","v":""},null,""]
[null,null,null,{"$f":"IF(E75=\"\",\"\",Customer!E$7)","v":""},null,"","","",null,{"$f":"CONCATENATE(IF(AND(E75<>\"\",OR(I$9=\"\",J$9=\"\")),VLOOKUP(300,TextID,CODE(Language!$B$4)-64,FALSE),\"\"),IF(AND(E75<>\"\",I75=\"\"),VLOOKUP(302,TextID,CODE(Language!$B$4)-64,FALSE),\"\"),IF(AND(E75=\"\",I75<>\"\"),VLOOKUP(306,TextID,CODE(Language!$B$4)-64,FALSE),\"\"),IF(AND(E75<>\"\",E75=E74),VLOOKUP(308,TextID,CODE(Language!$B$4)-64,FALSE),\"\"),IF(AND(E75<>\"\",LEFT(E75,2)=\"GV\"),VLOOKUP(328,Language!A:F,6,FALSE),\"\"))","v":""},null,""]
[null,null,null,{"$f":"IF(E76=\"\",\"\",Customer!E$7)","v":""},null,"","","",null,{"$f":"CONCATENATE(IF(AND(E76<>\"\",OR(I$9=\"\",J$9=\"\")),VLOOKUP(300,TextID,CODE(Language!$B$4)-64,FALSE),\"\"),IF(AND(E76<>\"\",I76=\"\"),VLOOKUP(302,TextID,CODE(Language!$B$4)-64,FALSE),\"\"),IF(AND(E76=\"\",I76<>\"\"),VLOOKUP(306,TextID,CODE(Language!$B$4)-64,FALSE),\"\"),IF(AND(E76<>\"\",E76=E75),VLOOKUP(308,TextID,CODE(Language!$B$4)-64,FALSE),\"\"),IF(AND(E76<>\"\",LEFT(E76,2)=\"GV\"),VLOOKUP(328,Language!A:F,6,FALSE),\"\"))","v":""},null,""]
[null,null,null,{"$f":"IF(E77=\"\",\"\",Customer!E$7)","v":""},null,"",{"$f":"IF($E77=\"\",\"\",VLOOKUP($E77,Material1b,3))","v":""},{"$f":"IF(E77=\"\",\"\",I$9)","v":""},null,{"$f":"CONCATENATE(IF(AND(E77<>\"\",OR(I$9=\"\",J$9=\"\")),VLOOKUP(300,TextID,CODE(Language!$B$4)-64,FALSE),\"\"),IF(AND(E77<>\"\",I77=\"\"),VLOOKUP(302,TextID,CODE(Language!$B$4)-64,FALSE),\"\"),IF(AND(E77=\"\",I77<>\"\"),VLOOKUP(306,TextID,CODE(Language!$B$4)-64,FALSE),\"\"),IF(AND(E77<>\"\",E77=E76),VLOOKUP(308,TextID,CODE(Language!$B$4)-64,FALSE),\"\"),IF(AND(E77<>\"\",LEFT(E77,2)=\"GV\"),VLOOKUP(328,Language!A:F,6,FALSE),\"\"))","v":""},null,""]
[null,null,null,{"$f":"IF(E78=\"\",\"\",Customer!E$7)","v":""},null,{"$f":"IF($E78=\"\",\"\",VLOOKUP($E78,Material1b,2))","v":""},"","",null,{"$f":"CONCATENATE(IF(AND(E78<>\"\",OR(I$9=\"\",J$9=\"\")),VLOOKUP(300,TextID,CODE(Language!$B$4)-64,FALSE),\"\"),IF(AND(E78<>\"\",I78=\"\"),VLOOKUP(302,TextID,CODE(Language!$B$4)-64,FALSE),\"\"),IF(AND(E78=\"\",I78<>\"\"),VLOOKUP(306,TextID,CODE(Language!$B$4)-64,FALSE),\"\"),IF(AND(E78<>\"\",E78=E77),VLOOKUP(308,TextID,CODE(Language!$B$4)-64,FALSE),\"\"),IF(AND(E78<>\"\",LEFT(E78,2)=\"GV\"),VLOOKUP(328,Language!A:F,6,FALSE),\"\"))","v":""},null,{"$f":"IF(E78=\"\",\"\",I$6)","v":""}]
[null,null,null,{"$f":"IF(E79=\"\",\"\",Customer!E$7)","v":""},null,"","","",null,{"$f":"CONCATENATE(IF(AND(E79<>\"\",OR(I$9=\"\",J$9=\"\")),VLOOKUP(300,TextID,CODE(Language!$B$4)-64,FALSE),\"\"),IF(AND(E79<>\"\",I79=\"\"),VLOOKUP(302,TextID,CODE(Language!$B$4)-64,FALSE),\"\"),IF(AND(E79=\"\",I79<>\"\"),VLOOKUP(306,TextID,CODE(Language!$B$4)-64,FALSE),\"\"),IF(AND(E79<>\"\",E79=E78),VLOOKUP(308,TextID,CODE(Language!$B$4)-64,FALSE),\"\"),IF(AND(E79<>\"\",LEFT(E79,2)=\"GV\"),VLOOKUP(328,Language!A:F,6,FALSE),\"\"))","v":""},null,""]
[null,null,null,{"$f":"IF(E80=\"\",\"\",Customer!E$7)","v":""},null,"","","",null,{"$f":"CONCATENATE(IF(AND(E80<>\"\",OR(I$9=\"\",J$9=\"\")),VLOOKUP(300,TextID,CODE(Language!$B$4)-64,FALSE),\"\"),IF(AND(E80<>\"\",I80=\"\"),VLOOKUP(302,TextID,CODE(Language!$B$4)-64,FALSE),\"\"),IF(AND(E80=\"\",I80<>\"\"),VLOOKUP(306,TextID,CODE(Language!$B$4)-64,FALSE),\"\"),IF(AND(E80<>\"\",E80=E79),VLOOKUP(308,TextID,CODE(Language!$B$4)-64,FALSE),\"\"),IF(AND(E80<>\"\",LEFT(E80,2)=\"GV\"),VLOOKUP(328,Language!A:F,6,FALSE),\"\"))","v":""},null,""]
[null,null,null,{"$f":"IF(E81=\"\",\"\",Customer!E$7)","v":""},null,"","","",null,{"$f":"CONCATENATE(IF(AND(E81<>\"\",OR(I$9=\"\",J$9=\"\")),VLOOKUP(300,TextID,CODE(Language!$B$4)-64,FALSE),\"\"),IF(AND(E81<>\"\",I81=\"\"),VLOOKUP(302,TextID,CODE(Language!$B$4)-64,FALSE),\"\"),IF(AND(E81=\"\",I81<>\"\"),VLOOKUP(306,TextID,CODE(Language!$B$4)-64,FALSE),\"\"),IF(AND(E81<>\"\",E81=E80),VLOOKUP(308,TextID,CODE(Language!$B$4)-64,FALSE),\"\"),IF(AND(E81<>\"\",LEFT(E81,2)=\"GV\"),VLOOKUP(328,Language!A:F,6,FALSE),\"\"))","v":""},null,""]
[null,null,null,{"$f":"IF(E82=\"\",\"\",Customer!E$7)","v":""},null,"","","",null,{"$f":"CONCATENATE(IF(AND(E82<>\"\",OR(I$9=\"\",J$9=\"\")),VLOOKUP(300,TextID,CODE(Language!$B$4)-64,FALSE),\"\"),IF(AND(E82<>\"\",I82=\"\"),VLOOKUP(302,TextID,CODE(Language!$B$4)-64,FALSE),\"\"),IF(AND(E82=\"\",I82<>\"\"),VLOOKUP(306,TextID,CODE(Language!$B$4)-64,FALSE),\"\"),IF(AND(E82<>\"\",E82=E81),VLOOKUP(308,TextID,CODE(Language!$B$4)-64,FALSE),\"\"),IF(AND(E82<>\"\",LEFT(E82,2)=\"GV\"),VLOOKUP(328,Language!A:F,6,FALSE),\"\"))","v":""},null,""]
[null,null,null,{"$f":"IF(E83=\"\",\"\",Customer!E$7)","v":""},null,"","","",null,{"$f":"CONCATENATE(IF(AND(E83<>\"\",OR(I$9=\"\",J$9=\"\")),VLOOKUP(300,TextID,CODE(Language!$B$4)-64,FALSE),\"\"),IF(AND(E83<>\"\",I83=\"\"),VLOOKUP(302,TextID,CODE(Language!$B$4)-64,FALSE),\"\"),IF(AND(E83=\"\",I83<>\"\"),VLOOKUP(306,TextID,CODE(Language!$B$4)-64,FALSE),\"\"),IF(AND(E83<>\"\",E83=E82),VLOOKUP(308,TextID,CODE(Language!$B$4)-64,FALSE),\"\"),IF(AND(E83<>\"\",LEFT(E83,2)=\"GV\"),VLOOKUP(328,Language!A:F,6,FALSE),\"\"))","v":""},null,""]
[null,null,null,{"$f":"IF(E84=\"\",\"\",Customer!E$7)","v":""},null,"","","",null,{"$f":"CONCATENATE(IF(AND(E84<>\"\",OR(I$9=\"\",J$9=\"\")),VLOOKUP(300,TextID,CODE(Language!$B$4)-64,FALSE),\"\"),IF(AND(E84<>\"\",I84=\"\"),VLOOKUP(302,TextID,CODE(Language!$B$4)-64,FALSE),\"\"),IF(AND(E84=\"\",I84<>\"\"),VLOOKUP(306,TextID,CODE(Language!$B$4)-64,FALSE),\"\"),IF(AND(E84<>\"\",E84=E83),VLOOKUP(308,TextID,CODE(Language!$B$4)-64,FALSE),\"\"),IF(AND(E84<>\"\",LEFT(E84,2)=\"GV\"),VLOOKUP(328,Language!A:F,6,FALSE),\"\"))","v":""},null,""]
[null,null,null,{"$f":"IF(E85=\"\",\"\",Customer!E$7)","v":""},null,"","","",null,{"$f":"CONCATENATE(IF(AND(E85<>\"\",OR(I$9=\"\",J$9=\"\")),VLOOKUP(300,TextID,CODE(Language!$B$4)-64,FALSE),\"\"),IF(AND(E85<>\"\",I85=\"\"),VLOOKUP(302,TextID,CODE(Language!$B$4)-64,FALSE),\"\"),IF(AND(E85=\"\",I85<>\"\"),VLOOKUP(306,TextID,CODE(Language!$B$4)-64,FALSE),\"\"),IF(AND(E85<>\"\",E85=E84),VLOOKUP(308,TextID,CODE(Language!$B$4)-64,FALSE),\"\"),IF(AND(E85<>\"\",LEFT(E85,2)=\"GV\"),VLOOKUP(328,Language!A:F,6,FALSE),\"\"))","v":""},null,""]
[null,null,null,{"$f":"IF(E86=\"\",\"\",Customer!E$7)","v":""},null,"","","",null,{"$f":"CONCATENATE(IF(AND(E86<>\"\",OR(I$9=\"\",J$9=\"\")),VLOOKUP(300,TextID,CODE(Language!$B$4)-64,FALSE),\"\"),IF(AND(E86<>\"\",I86=\"\"),VLOOKUP(302,TextID,CODE(Language!$B$4)-64,FALSE),\"\"),IF(AND(E86=\"\",I86<>\"\"),VLOOKUP(306,TextID,CODE(Language!$B$4)-64,FALSE),\"\"),IF(AND(E86<>\"\",E86=E85),VLOOKUP(308,TextID,CODE(Language!$B$4)-64,FALSE),\"\"),IF(AND(E86<>\"\",LEFT(E86,2)=\"GV\"),VLOOKUP(328,Language!A:F,6,FALSE),\"\"))","v":""},null,""]
[null,null,null,{"$f":"IF(E87=\"\",\"\",Customer!E$7)","v":""},null,"","","",null,{"$f":"CONCATENATE(IF(AND(E87<>\"\",OR(I$9=\"\",J$9=\"\")),VLOOKUP(300,TextID,CODE(Language!$B$4)-64,FALSE),\"\"),IF(AND(E87<>\"\",I87=\"\"),VLOOKUP(302,TextID,CODE(Language!$B$4)-64,FALSE),\"\"),IF(AND(E87=\"\",I87<>\"\"),VLOOKUP(306,TextID,CODE(Language!$B$4)-64,FALSE),\"\"),IF(AND(E87<>\"\",E87=E86),VLOOKUP(308,TextID,CODE(Language!$B$4)-64,FALSE),\"\"),IF(AND(E87<>\"\",LEFT(E87,2)=\"GV\"),VLOOKUP(328,Language!A:F,6,FALSE),\"\"))","v":""},null,""]
[null,null,null,{"$f":"IF(E88=\"\",\"\",Customer!E$7)","v":""},null,"","","",null,{"$f":"CONCATENATE(IF(AND(E88<>\"\",OR(I$9=\"\",J$9=\"\")),VLOOKUP(300,TextID,CODE(Language!$B$4)-64,FALSE),\"\"),IF(AND(E88<>\"\",I88=\"\"),VLOOKUP(302,TextID,CODE(Language!$B$4)-64,FALSE),\"\"),IF(AND(E88=\"\",I88<>\"\"),VLOOKUP(306,TextID,CODE(Language!$B$4)-64,FALSE),\"\"),IF(AND(E88<>\"\",E88=E87),VLOOKUP(308,TextID,CODE(Language!$B$4)-64,FALSE),\"\"),IF(AND(E88<>\"\",LEFT(E88,2)=\"GV\"),VLOOKUP(328,Language!A:F,6,FALSE),\"\"))","v":""},null,""]
[null,null,null,{"$f":"IF(E89=\"\",\"\",Customer!E$7)","v":""},null,"","","",null,{"$f":"CONCATENATE(IF(AND(E89<>\"\",OR(I$9=\"\",J$9=\"\")),VLOOKUP(300,TextID,CODE(Language!$B$4)-64,FALSE),\"\"),IF(AND(E89<>\"\",I89=\"\"),VLOOKUP(302,TextID,CODE(Language!$B$4)-64,FALSE),\"\"),IF(AND(E89=\"\",I89<>\"\"),VLOOKUP(306,TextID,CODE(Language!$B$4)-64,FALSE),\"\"),IF(AND(E89<>\"\",E89=E88),VLOOKUP(308,TextID,CODE(Language!$B$4)-64,FALSE),\"\"),IF(AND(E89<>\"\",LEFT(E89,2)=\"GV\"),VLOOKUP(328,Language!A:F,6,FALSE),\"\"))","v":""},null,""]
[null,null,null,{"$f":"IF(E90=\"\",\"\",Customer!E$7)","v":""},null,"","","",null,{"$f":"CONCATENATE(IF(AND(E90<>\"\",OR(I$9=\"\",J$9=\"\")),VLOOKUP(300,TextID,CODE(Language!$B$4)-64,FALSE),\"\"),IF(AND(E90<>\"\",I90=\"\"),VLOOKUP(302,TextID,CODE(Language!$B$4)-64,FALSE),\"\"),IF(AND(E90=\"\",I90<>\"\"),VLOOKUP(306,TextID,CODE(Language!$B$4)-64,FALSE),\"\"),IF(AND(E90<>\"\",E90=E89),VLOOKUP(308,TextID,CODE(Language!$B$4)-64,FALSE),\"\"),IF(AND(E90<>\"\",LEFT(E90,2)=\"GV\"),VLOOKUP(328,Language!A:F,6,FALSE),\"\"))","v":""},null,""]
[null,null,null,{"$f":"IF(E91=\"\",\"\",Customer!E$7)","v":""},null,"","","",null,{"$f":"CONCATENATE(IF(AND(E91<>\"\",OR(I$9=\"\",J$9=\"\")),VLOOKUP(300,TextID,CODE(Language!$B$4)-64,FALSE),\"\"),IF(AND(E91<>\"\",I91=\"\"),VLOOKUP(302,TextID,CODE(Language!$B$4)-64,FALSE),\"\"),IF(AND(E91=\"\",I91<>\"\"),VLOOKUP(306,TextID,CODE(Language!$B$4)-64,FALSE),\"\"),IF(AND(E91<>\"\",E91=E90),VLOOKUP(308,TextID,CODE(Language!$B$4)-64,FALSE),\"\"),IF(AND(E91<>\"\",LEFT(E91,2)=\"GV\"),VLOOKUP(328,Language!A:F,6,FALSE),\"\"))","v":""},null,""]
[null,null,null,{"$f":"IF(E92=\"\",\"\",Customer!E$7)","v":""},null,"","","",null,{"$f":"CONCATENATE(IF(AND(E92<>\"\",OR(I$9=\"\",J$9=\"\")),VLOOKUP(300,TextID,CODE(Language!$B$4)-64,FALSE),\"\"),IF(AND(E92<>\"\",I92=\"\"),VLOOKUP(302,TextID,CODE(Language!$B$4)-64,FALSE),\"\"),IF(AND(E92=\"\",I92<>\"\"),VLOOKUP(306,TextID,CODE(Language!$B$4)-64,FALSE),\"\"),IF(AND(E92<>\"\",E92=E91),VLOOKUP(308,TextID,CODE(Language!$B$4)-64,FALSE),\"\"),IF(AND(E92<>\"\",LEFT(E92,2)=\"GV\"),VLOOKUP(328,Language!A:F,6,FALSE),\"\"))","v":""},null,""]
[null,null,null,{"$f":"IF(E93=\"\",\"\",Customer!E$7)","v":""},null,"","","",null,{"$f":"CONCATENATE(IF(AND(E93<>\"\",OR(I$9=\"\",J$9=\"\")),VLOOKUP(300,TextID,CODE(Language!$B$4)-64,FALSE),\"\"),IF(AND(E93<>\"\",I93=\"\"),VLOOKUP(302,TextID,CODE(Language!$B$4)-64,FALSE),\"\"),IF(AND(E93=\"\",I93<>\"\"),VLOOKUP(306,TextID,CODE(Language!$B$4)-64,FALSE),\"\"),IF(AND(E93<>\"\",E93=E92),VLOOKUP(308,TextID,CODE(Language!$B$4)-64,FALSE),\"\"),IF(AND(E93<>\"\",LEFT(E93,2)=\"GV\"),VLOOKUP(328,Language!A:F,6,FALSE),\"\"))","v":""},null,""]
[null,null,null,{"$f":"IF(E94=\"\",\"\",Customer!E$7)","v":""},null,"","","",null,{"$f":"CONCATENATE(IF(AND(E94<>\"\",OR(I$9=\"\",J$9=\"\")),VLOOKUP(300,TextID,CODE(Language!$B$4)-64,FALSE),\"\"),IF(AND(E94<>\"\",I94=\"\"),VLOOKUP(302,TextID,CODE(Language!$B$4)-64,FALSE),\"\"),IF(AND(E94=\"\",I94<>\"\"),VLOOKUP(306,TextID,CODE(Language!$B$4)-64,FALSE),\"\"),IF(AND(E94<>\"\",E94=E93),VLOOKUP(308,TextID,CODE(Language!$B$4)-64,FALSE),\"\"),IF(AND(E94<>\"\",LEFT(E94,2)=\"GV\"),VLOOKUP(328,Language!A:F,6,FALSE),\"\"))","v":""},null,""]
[null,null,null,{"$f":"IF(E95=\"\",\"\",Customer!E$7)","v":""},null,"","","",null,{"$f":"CONCATENATE(IF(AND(E95<>\"\",OR(I$9=\"\",J$9=\"\")),VLOOKUP(300,TextID,CODE(Language!$B$4)-64,FALSE),\"\"),IF(AND(E95<>\"\",I95=\"\"),VLOOKUP(302,TextID,CODE(Language!$B$4)-64,FALSE),\"\"),IF(AND(E95=\"\",I95<>\"\"),VLOOKUP(306,TextID,CODE(Language!$B$4)-64,FALSE),\"\"),IF(AND(E95<>\"\",E95=E94),VLOOKUP(308,TextID,CODE(Language!$B$4)-64,FALSE),\"\"),IF(AND(E95<>\"\",LEFT(E95,2)=\"GV\"),VLOOKUP(328,Language!A:F,6,FALSE),\"\"))","v":""},null,""]
[null,null,null,{"$f":"IF(E96=\"\",\"\",Customer!E$7)","v":""},null,"","","",null,{"$f":"CONCATENATE(IF(AND(E96<>\"\",OR(I$9=\"\",J$9=\"\")),VLOOKUP(300,TextID,CODE(Language!$B$4)-64,FALSE),\"\"),IF(AND(E96<>\"\",I96=\"\"),VLOOKUP(302,TextID,CODE(Language!$B$4)-64,FALSE),\"\"),IF(AND(E96=\"\",I96<>\"\"),VLOOKUP(306,TextID,CODE(Language!$B$4)-64,FALSE),\"\"),IF(AND(E96<>\"\",E96=E95),VLOOKUP(308,TextID,CODE(Language!$B$4)-64,FALSE),\"\"),IF(AND(E96<>\"\",LEFT(E96,2)=\"GV\"),VLOOKUP(328,Language!A:F,6,FALSE),\"\"))","v":""},null,""]
[null,null,null,{"$f":"IF(E97=\"\",\"\",Customer!E$7)","v":""},null,"","","",null,{"$f":"CONCATENATE(IF(AND(E97<>\"\",OR(I$9=\"\",J$9=\"\")),VLOOKUP(300,TextID,CODE(Language!$B$4)-64,FALSE),\"\"),IF(AND(E97<>\"\",I97=\"\"),VLOOKUP(302,TextID,CODE(Language!$B$4)-64,FALSE),\"\"),IF(AND(E97=\"\",I97<>\"\"),VLOOKUP(306,TextID,CODE(Language!$B$4)-64,FALSE),\"\"),IF(AND(E97<>\"\",E97=E96),VLOOKUP(308,TextID,CODE(Language!$B$4)-64,FALSE),\"\"),IF(AND(E97<>\"\",LEFT(E97,2)=\"GV\"),VLOOKUP(328,Language!A:F,6,FALSE),\"\"))","v":""},null,""]
[null,null,null,{"$f":"IF(E98=\"\",\"\",Customer!E$7)","v":""},null,"","","",null,{"$f":"CONCATENATE(IF(AND(E98<>\"\",OR(I$9=\"\",J$9=\"\")),VLOOKUP(300,TextID,CODE(Language!$B$4)-64,FALSE),\"\"),IF(AND(E98<>\"\",I98=\"\"),VLOOKUP(302,TextID,CODE(Language!$B$4)-64,FALSE),\"\"),IF(AND(E98=\"\",I98<>\"\"),VLOOKUP(306,TextID,CODE(Language!$B$4)-64,FALSE),\"\"),IF(AND(E98<>\"\",E98=E97),VLOOKUP(308,TextID,CODE(Language!$B$4)-64,FALSE),\"\"),IF(AND(E98<>\"\",LEFT(E98,2)=\"GV\"),VLOOKUP(328,Language!A:F,6,FALSE),\"\"))","v":""},null,""]
[null,null,null,{"$f":"IF(E99=\"\",\"\",Customer!E$7)","v":""},null,"","","",null,{"$f":"CONCATENATE(IF(AND(E99<>\"\",OR(I$9=\"\",J$9=\"\")),VLOOKUP(300,TextID,CODE(Language!$B$4)-64,FALSE),\"\"),IF(AND(E99<>\"\",I99=\"\"),VLOOKUP(302,TextID,CODE(Language!$B$4)-64,FALSE),\"\"),IF(AND(E99=\"\",I99<>\"\"),VLOOKUP(306,TextID,CODE(Language!$B$4)-64,FALSE),\"\"),IF(AND(E99<>\"\",E99=E98),VLOOKUP(308,TextID,CODE(Language!$B$4)-64,FALSE),\"\"),IF(AND(E99<>\"\",LEFT(E99,2)=\"GV\"),VLOOKUP(328,Language!A:F,6,FALSE),\"\"))","v":""},null,""]
[null,null,null,{"$f":"IF(E100=\"\",\"\",Customer!E$7)","v":""},null,"","","",null,{"$f":"CONCATENATE(IF(AND(E100<>\"\",OR(I$9=\"\",J$9=\"\")),VLOOKUP(300,TextID,CODE(Language!$B$4)-64,FALSE),\"\"),IF(AND(E100<>\"\",I100=\"\"),VLOOKUP(302,TextID,CODE(Language!$B$4)-64,FALSE),\"\"),IF(AND(E100=\"\",I100<>\"\"),VLOOKUP(306,TextID,CODE(Language!$B$4)-64,FALSE),\"\"),IF(AND(E100<>\"\",E100=E99),VLOOKUP(308,TextID,CODE(Language!$B$4)-64,FALSE),\"\"),IF(AND(E100<>\"\",LEFT(E100,2)=\"GV\"),VLOOKUP(328,Language!A:F,6,FALSE),\"\"))","v":""},null,""]
[null,null,null,{"$f":"IF(E101=\"\",\"\",Customer!E$7)","v":""},null,"","","",null,{"$f":"CONCATENATE(IF(AND(E101<>\"\",OR(I$9=\"\",J$9=\"\")),VLOOKUP(300,TextID,CODE(Language!$B$4)-64,FALSE),\"\"),IF(AND(E101<>\"\",I101=\"\"),VLOOKUP(302,TextID,CODE(Language!$B$4)-64,FALSE),\"\"),IF(AND(E101=\"\",I101<>\"\"),VLOOKUP(306,TextID,CODE(Language!$B$4)-64,FALSE),\"\"),IF(AND(E101<>\"\",E101=E100),VLOOKUP(308,TextID,CODE(Language!$B$4)-64,FALSE),\"\"),IF(AND(E101<>\"\",LEFT(E101,2)=\"GV\"),VLOOKUP(328,Language!A:F,6,FALSE),\"\"))","v":""},null,""]
[null,null,null,{"$f":"IF(E102=\"\",\"\",Customer!E$7)","v":""},null,"","","",null,{"$f":"CONCATENATE(IF(AND(E102<>\"\",OR(I$9=\"\",J$9=\"\")),VLOOKUP(300,TextID,CODE(Language!$B$4)-64,FALSE),\"\"),IF(AND(E102<>\"\",I102=\"\"),VLOOKUP(302,TextID,CODE(Language!$B$4)-64,FALSE),\"\"),IF(AND(E102=\"\",I102<>\"\"),VLOOKUP(306,TextID,CODE(Language!$B$4)-64,FALSE),\"\"),IF(AND(E102<>\"\",E102=E101),VLOOKUP(308,TextID,CODE(Language!$B$4)-64,FALSE),\"\"),IF(AND(E102<>\"\",LEFT(E102,2)=\"GV\"),VLOOKUP(328,Language!A:F,6,FALSE),\"\"))","v":""},null,""]
[null,null,null,{"$f":"IF(E103=\"\",\"\",Customer!E$7)","v":""},null,"","","",null,{"$f":"CONCATENATE(IF(AND(E103<>\"\",OR(I$9=\"\",J$9=\"\")),VLOOKUP(300,TextID,CODE(Language!$B$4)-64,FALSE),\"\"),IF(AND(E103<>\"\",I103=\"\"),VLOOKUP(302,TextID,CODE(Language!$B$4)-64,FALSE),\"\"),IF(AND(E103=\"\",I103<>\"\"),VLOOKUP(306,TextID,CODE(Language!$B$4)-64,FALSE),\"\"),IF(AND(E103<>\"\",E103=E102),VLOOKUP(308,TextID,CODE(Language!$B$4)-64,FALSE),\"\"),IF(AND(E103<>\"\",LEFT(E103,2)=\"GV\"),VLOOKUP(328,Language!A:F,6,FALSE),\"\"))","v":""},null,""]
[null,null,null,{"$f":"IF(E104=\"\",\"\",Customer!E$7)","v":""},null,"","","",null,{"$f":"CONCATENATE(IF(AND(E104<>\"\",OR(I$9=\"\",J$9=\"\")),VLOOKUP(300,TextID,CODE(Language!$B$4)-64,FALSE),\"\"),IF(AND(E104<>\"\",I104=\"\"),VLOOKUP(302,TextID,CODE(Language!$B$4)-64,FALSE),\"\"),IF(AND(E104=\"\",I104<>\"\"),VLOOKUP(306,TextID,CODE(Language!$B$4)-64,FALSE),\"\"),IF(AND(E104<>\"\",E104=E103),VLOOKUP(308,TextID,CODE(Language!$B$4)-64,FALSE),\"\"),IF(AND(E104<>\"\",LEFT(E104,2)=\"GV\"),VLOOKUP(328,Language!A:F,6,FALSE),\"\"))","v":""},null,""]
[null,null,null,{"$f":"IF(E105=\"\",\"\",Customer!E$7)","v":""},null,"","","",null,{"$f":"CONCATENATE(IF(AND(E105<>\"\",OR(I$9=\"\",J$9=\"\")),VLOOKUP(300,TextID,CODE(Language!$B$4)-64,FALSE),\"\"),IF(AND(E105<>\"\",I105=\"\"),VLOOKUP(302,TextID,CODE(Language!$B$4)-64,FALSE),\"\"),IF(AND(E105=\"\",I105<>\"\"),VLOOKUP(306,TextID,CODE(Language!$B$4)-64,FALSE),\"\"),IF(AND(E105<>\"\",E105=E104),VLOOKUP(308,TextID,CODE(Language!$B$4)-64,FALSE),\"\"),IF(AND(E105<>\"\",LEFT(E105,2)=\"GV\"),VLOOKUP(328,Language!A:F,6,FALSE),\"\"))","v":""},null,""]
[null,null,null,{"$f":"IF(E106=\"\",\"\",Customer!E$7)","v":""},null,"","","",null,{"$f":"CONCATENATE(IF(AND(E106<>\"\",OR(I$9=\"\",J$9=\"\")),VLOOKUP(300,TextID,CODE(Language!$B$4)-64,FALSE),\"\"),IF(AND(E106<>\"\",I106=\"\"),VLOOKUP(302,TextID,CODE(Language!$B$4)-64,FALSE),\"\"),IF(AND(E106=\"\",I106<>\"\"),VLOOKUP(306,TextID,CODE(Language!$B$4)-64,FALSE),\"\"),IF(AND(E106<>\"\",E106=E105),VLOOKUP(308,TextID,CODE(Language!$B$4)-64,FALSE),\"\"),IF(AND(E106<>\"\",LEFT(E106,2)=\"GV\"),VLOOKUP(328,Language!A:F,6,FALSE),\"\"))","v":""},null,""]
[null,null,null,{"$f":"IF(E107=\"\",\"\",Customer!E$7)","v":""},null,"","","",null,{"$f":"CONCATENATE(IF(AND(E107<>\"\",OR(I$9=\"\",J$9=\"\")),VLOOKUP(300,TextID,CODE(Language!$B$4)-64,FALSE),\"\"),IF(AND(E107<>\"\",I107=\"\"),VLOOKUP(302,TextID,CODE(Language!$B$4)-64,FALSE),\"\"),IF(AND(E107=\"\",I107<>\"\"),VLOOKUP(306,TextID,CODE(Language!$B$4)-64,FALSE),\"\"),IF(AND(E107<>\"\",E107=E106),VLOOKUP(308,TextID,CODE(Language!$B$4)-64,FALSE),\"\"),IF(AND(E107<>\"\",LEFT(E107,2)=\"GV\"),VLOOKUP(328,Language!A:F,6,FALSE),\"\"))","v":""},null,""]
[null,null,null,{"$f":"IF(E108=\"\",\"\",Customer!E$7)","v":""},null,"","","",null,{"$f":"CONCATENATE(IF(AND(E108<>\"\",OR(I$9=\"\",J$9=\"\")),VLOOKUP(300,TextID,CODE(Language!$B$4)-64,FALSE),\"\"),IF(AND(E108<>\"\",I108=\"\"),VLOOKUP(302,TextID,CODE(Language!$B$4)-64,FALSE),\"\"),IF(AND(E108=\"\",I108<>\"\"),VLOOKUP(306,TextID,CODE(Language!$B$4)-64,FALSE),\"\"),IF(AND(E108<>\"\",E108=E107),VLOOKUP(308,TextID,CODE(Language!$B$4)-64,FALSE),\"\"),IF(AND(E108<>\"\",LEFT(E108,2)=\"GV\"),VLOOKUP(328,Language!A:F,6,FALSE),\"\"))","v":""},null,""]
[null,null,null,{"$f":"IF(E109=\"\",\"\",Customer!E$7)","v":""},null,"",{"$f":"IF($E109=\"\",\"\",VLOOKUP($E109,Material1b,3))","v":""},{"$f":"IF(E109=\"\",\"\",I$9)","v":""},null,{"$f":"CONCATENATE(IF(AND(E109<>\"\",OR(I$9=\"\",J$9=\"\")),VLOOKUP(300,TextID,CODE(Language!$B$4)-64,FALSE),\"\"),IF(AND(E109<>\"\",I109=\"\"),VLOOKUP(302,TextID,CODE(Language!$B$4)-64,FALSE),\"\"),IF(AND(E109=\"\",I109<>\"\"),VLOOKUP(306,TextID,CODE(Language!$B$4)-64,FALSE),\"\"),IF(AND(E109<>\"\",E109=E108),VLOOKUP(308,TextID,CODE(Language!$B$4)-64,FALSE),\"\"),IF(AND(E109<>\"\",LEFT(E109,2)=\"GV\"),VLOOKUP(328,Language!A:F,6,FALSE),\"\"))","v":""},null,""]
[null,null,null,{"$f":"IF(E110=\"\",\"\",Customer!E$7)","v":""},null,{"$f":"IF($E110=\"\",\"\",VLOOKUP($E110,Material1b,2))","v":""},"","",null,{"$f":"CONCATENATE(IF(AND(E110<>\"\",OR(I$9=\"\",J$9=\"\")),VLOOKUP(300,TextID,CODE(Language!$B$4)-64,FALSE),\"\"),IF(AND(E110<>\"\",I110=\"\"),VLOOKUP(302,TextID,CODE(Language!$B$4)-64,FALSE),\"\"),IF(AND(E110=\"\",I110<>\"\"),VLOOKUP(306,TextID,CODE(Language!$B$4)-64,FALSE),\"\"),IF(AND(E110<>\"\",E110=E109),VLOOKUP(308,TextID,CODE(Language!$B$4)-64,FALSE),\"\"),IF(AND(E110<>\"\",LEFT(E110,2)=\"GV\"),VLOOKUP(328,Language!A:F,6,FALSE),\"\"))","v":""},null,""]
[null,null,null,{"$f":"IF(E111=\"\",\"\",Customer!E$7)","v":""},null,"","","",null,{"$f":"CONCATENATE(IF(AND(E111<>\"\",OR(I$9=\"\",J$9=\"\")),VLOOKUP(300,TextID,CODE(Language!$B$4)-64,FALSE),\"\"),IF(AND(E111<>\"\",I111=\"\"),VLOOKUP(302,TextID,CODE(Language!$B$4)-64,FALSE),\"\"),IF(AND(E111=\"\",I111<>\"\"),VLOOKUP(306,TextID,CODE(Language!$B$4)-64,FALSE),\"\"),IF(AND(E111<>\"\",E111=E110),VLOOKUP(308,TextID,CODE(Language!$B$4)-64,FALSE),\"\"),IF(AND(E111<>\"\",LEFT(E111,2)=\"GV\"),VLOOKUP(328,Language!A:F,6,FALSE),\"\"))","v":""},null,""]
[null,null,null,{"$f":"IF(E112=\"\",\"\",Customer!E$7)","v":""},null,"","","",null,{"$f":"CONCATENATE(IF(AND(E112<>\"\",OR(I$9=\"\",J$9=\"\")),VLOOKUP(300,TextID,CODE(Language!$B$4)-64,FALSE),\"\"),IF(AND(E112<>\"\",I112=\"\"),VLOOKUP(302,TextID,CODE(Language!$B$4)-64,FALSE),\"\"),IF(AND(E112=\"\",I112<>\"\"),VLOOKUP(306,TextID,CODE(Language!$B$4)-64,FALSE),\"\"),IF(AND(E112<>\"\",E112=E111),VLOOKUP(308,TextID,CODE(Language!$B$4)-64,FALSE),\"\"),IF(AND(E112<>\"\",LEFT(E112,2)=\"GV\"),VLOOKUP(328,Language!A:F,6,FALSE),\"\"))","v":""},null,""]
[null,null,null,{"$f":"IF(E113=\"\",\"\",Customer!E$7)","v":""},null,"","","",null,{"$f":"CONCATENATE(IF(AND(E113<>\"\",OR(I$9=\"\",J$9=\"\")),VLOOKUP(300,TextID,CODE(Language!$B$4)-64,FALSE),\"\"),IF(AND(E113<>\"\",I113=\"\"),VLOOKUP(302,TextID,CODE(Language!$B$4)-64,FALSE),\"\"),IF(AND(E113=\"\",I113<>\"\"),VLOOKUP(306,TextID,CODE(Language!$B$4)-64,FALSE),\"\"),IF(AND(E113<>\"\",E113=E112),VLOOKUP(308,TextID,CODE(Language!$B$4)-64,FALSE),\"\"),IF(AND(E113<>\"\",LEFT(E113,2)=\"GV\"),VLOOKUP(328,Language!A:F,6,FALSE),\"\"))","v":""},null,""]
[null,null,null,{"$f":"IF(E114=\"\",\"\",Customer!E$7)","v":""},null,"","","",null,{"$f":"CONCATENATE(IF(AND(E114<>\"\",OR(I$9=\"\",J$9=\"\")),VLOOKUP(300,TextID,CODE(Language!$B$4)-64,FALSE),\"\"),IF(AND(E114<>\"\",I114=\"\"),VLOOKUP(302,TextID,CODE(Language!$B$4)-64,FALSE),\"\"),IF(AND(E114=\"\",I114<>\"\"),VLOOKUP(306,TextID,CODE(Language!$B$4)-64,FALSE),\"\"),IF(AND(E114<>\"\",E114=E113),VLOOKUP(308,TextID,CODE(Language!$B$4)-64,FALSE),\"\"),IF(AND(E114<>\"\",LEFT(E114,2)=\"GV\"),VLOOKUP(328,Language!A:F,6,FALSE),\"\"))","v":""},null,""]
[null,null,null,{"$f":"IF(E115=\"\",\"\",Customer!E$7)","v":""},null,"","","",null,{"$f":"CONCATENATE(IF(AND(E115<>\"\",OR(I$9=\"\",J$9=\"\")),VLOOKUP(300,TextID,CODE(Language!$B$4)-64,FALSE),\"\"),IF(AND(E115<>\"\",I115=\"\"),VLOOKUP(302,TextID,CODE(Language!$B$4)-64,FALSE),\"\"),IF(AND(E115=\"\",I115<>\"\"),VLOOKUP(306,TextID,CODE(Language!$B$4)-64,FALSE),\"\"),IF(AND(E115<>\"\",E115=E114),VLOOKUP(308,TextID,CODE(Language!$B$4)-64,FALSE),\"\"),IF(AND(E115<>\"\",LEFT(E115,2)=\"GV\"),VLOOKUP(328,Language!A:F,6,FALSE),\"\"))","v":""},null,""]
[null,null,null,{"$f":"IF(E116=\"\",\"\",Customer!E$7)","v":""},null,"","","",null,{"$f":"CONCATENATE(IF(AND(E116<>\"\",OR(I$9=\"\",J$9=\"\")),VLOOKUP(300,TextID,CODE(Language!$B$4)-64,FALSE),\"\"),IF(AND(E116<>\"\",I116=\"\"),VLOOKUP(302,TextID,CODE(Language!$B$4)-64,FALSE),\"\"),IF(AND(E116=\"\",I116<>\"\"),VLOOKUP(306,TextID,CODE(Language!$B$4)-64,FALSE),\"\"),IF(AND(E116<>\"\",E116=E115),VLOOKUP(308,TextID,CODE(Language!$B$4)-64,FALSE),\"\"),IF(AND(E116<>\"\",LEFT(E116,2)=\"GV\"),VLOOKUP(328,Language!A:F,6,FALSE),\"\"))","v":""},null,""]
[null,null,null,{"$f":"IF(E117=\"\",\"\",Customer!E$7)","v":""},null,"","","",null,{"$f":"CONCATENATE(IF(AND(E117<>\"\",OR(I$9=\"\",J$9=\"\")),VLOOKUP(300,TextID,CODE(Language!$B$4)-64,FALSE),\"\"),IF(AND(E117<>\"\",I117=\"\"),VLOOKUP(302,TextID,CODE(Language!$B$4)-64,FALSE),\"\"),IF(AND(E117=\"\",I117<>\"\"),VLOOKUP(306,TextID,CODE(Language!$B$4)-64,FALSE),\"\"),IF(AND(E117<>\"\",E117=E116),VLOOKUP(308,TextID,CODE(Language!$B$4)-64,FALSE),\"\"),IF(AND(E117<>\"\",LEFT(E117,2)=\"GV\"),VLOOKUP(328,Language!A:F,6,FALSE),\"\"))","v":""},null,""]
[null,null,null,{"$f":"IF(E118=\"\",\"\",Customer!E$7)","v":""},null,"","","",null,{"$f":"CONCATENATE(IF(AND(E118<>\"\",OR(I$9=\"\",J$9=\"\")),VLOOKUP(300,TextID,CODE(Language!$B$4)-64,FALSE),\"\"),IF(AND(E118<>\"\",I118=\"\"),VLOOKUP(302,TextID,CODE(Language!$B$4)-64,FALSE),\"\"),IF(AND(E118=\"\",I118<>\"\"),VLOOKUP(306,TextID,CODE(Language!$B$4)-64,FALSE),\"\"),IF(AND(E118<>\"\",E118=E117),VLOOKUP(308,TextID,CODE(Language!$B$4)-64,FALSE),\"\"),IF(AND(E118<>\"\",LEFT(E118,2)=\"GV\"),VLOOKUP(328,Language!A:F,6,FALSE),\"\"))","v":""},null,""]
[null,null,null,{"$f":"IF(E119=\"\",\"\",Customer!E$7)","v":""},null,"","","",null,{"$f":"CONCATENATE(IF(AND(E119<>\"\",OR(I$9=\"\",J$9=\"\")),VLOOKUP(300,TextID,CODE(Language!$B$4)-64,FALSE),\"\"),IF(AND(E119<>\"\",I119=\"\"),VLOOKUP(302,TextID,CODE(Language!$B$4)-64,FALSE),\"\"),IF(AND(E119=\"\",I119<>\"\"),VLOOKUP(306,TextID,CODE(Language!$B$4)-64,FALSE),\"\"),IF(AND(E119<>\"\",E119=E118),VLOOKUP(308,TextID,CODE(Language!$B$4)-64,FALSE),\"\"),IF(AND(E119<>\"\",LEFT(E119,2)=\"GV\"),VLOOKUP(328,Language!A:F,6,FALSE),\"\"))","v":""},null,""]
[null,null,null,{"$f":"IF(E120=\"\",\"\",Customer!E$7)","v":""},null,"","","",null,{"$f":"CONCATENATE(IF(AND(E120<>\"\",OR(I$9=\"\",J$9=\"\")),VLOOKUP(300,TextID,CODE(Language!$B$4)-64,FALSE),\"\"),IF(AND(E120<>\"\",I120=\"\"),VLOOKUP(302,TextID,CODE(Language!$B$4)-64,FALSE),\"\"),IF(AND(E120=\"\",I120<>\"\"),VLOOKUP(306,TextID,CODE(Language!$B$4)-64,FALSE),\"\"),IF(AND(E120<>\"\",E120=E119),VLOOKUP(308,TextID,CODE(Language!$B$4)-64,FALSE),\"\"),IF(AND(E120<>\"\",LEFT(E120,2)=\"GV\"),VLOOKUP(328,Language!A:F,6,FALSE),\"\"))","v":""},null,""]
[null,null,null,{"$f":"IF(E121=\"\",\"\",Customer!E$7)","v":""},null,"","","",null,{"$f":"CONCATENATE(IF(AND(E121<>\"\",OR(I$9=\"\",J$9=\"\")),VLOOKUP(300,TextID,CODE(Language!$B$4)-64,FALSE),\"\"),IF(AND(E121<>\"\",I121=\"\"),VLOOKUP(302,TextID,CODE(Language!$B$4)-64,FALSE),\"\"),IF(AND(E121=\"\",I121<>\"\"),VLOOKUP(306,TextID,CODE(Language!$B$4)-64,FALSE),\"\"),IF(AND(E121<>\"\",E121=E120),VLOOKUP(308,TextID,CODE(Language!$B$4)-64,FALSE),\"\"),IF(AND(E121<>\"\",LEFT(E121,2)=\"GV\"),VLOOKUP(328,Language!A:F,6,FALSE),\"\"))","v":""},null,""]
[null,null,null,{"$f":"IF(E122=\"\",\"\",Customer!E$7)","v":""},null,"","","",null,{"$f":"CONCATENATE(IF(AND(E122<>\"\",OR(I$9=\"\",J$9=\"\")),VLOOKUP(300,TextID,CODE(Language!$B$4)-64,FALSE),\"\"),IF(AND(E122<>\"\",I122=\"\"),VLOOKUP(302,TextID,CODE(Language!$B$4)-64,FALSE),\"\"),IF(AND(E122=\"\",I122<>\"\"),VLOOKUP(306,TextID,CODE(Language!$B$4)-64,FALSE),\"\"),IF(AND(E122<>\"\",E122=E121),VLOOKUP(308,TextID,CODE(Language!$B$4)-64,FALSE),\"\"),IF(AND(E122<>\"\",LEFT(E122,2)=\"GV\"),VLOOKUP(328,Language!A:F,6,FALSE),\"\"))","v":""},null,""]
[null,null,null,{"$f":"IF(E123=\"\",\"\",Customer!E$7)","v":""},null,"","","",null,{"$f":"CONCATENATE(IF(AND(E123<>\"\",OR(I$9=\"\",J$9=\"\")),VLOOKUP(300,TextID,CODE(Language!$B$4)-64,FALSE),\"\"),IF(AND(E123<>\"\",I123=\"\"),VLOOKUP(302,TextID,CODE(Language!$B$4)-64,FALSE),\"\"),IF(AND(E123=\"\",I123<>\"\"),VLOOKUP(306,TextID,CODE(Language!$B$4)-64,FALSE),\"\"),IF(AND(E123<>\"\",E123=E122),VLOOKUP(308,TextID,CODE(Language!$B$4)-64,FALSE),\"\"),IF(AND(E123<>\"\",LEFT(E123,2)=\"GV\"),VLOOKUP(328,Language!A:F,6,FALSE),\"\"))","v":""},null,""]
[null,null,null,{"$f":"IF(E124=\"\",\"\",Customer!E$7)","v":""},null,"","","",null,{"$f":"CONCATENATE(IF(AND(E124<>\"\",OR(I$9=\"\",J$9=\"\")),VLOOKUP(300,TextID,CODE(Language!$B$4)-64,FALSE),\"\"),IF(AND(E124<>\"\",I124=\"\"),VLOOKUP(302,TextID,CODE(Language!$B$4)-64,FALSE),\"\"),IF(AND(E124=\"\",I124<>\"\"),VLOOKUP(306,TextID,CODE(Language!$B$4)-64,FALSE),\"\"),IF(AND(E124<>\"\",E124=E123),VLOOKUP(308,TextID,CODE(Language!$B$4)-64,FALSE),\"\"),IF(AND(E124<>\"\",LEFT(E124,2)=\"GV\"),VLOOKUP(328,Language!A:F,6,FALSE),\"\"))","v":""},null,""]
[null,null,null,{"$f":"IF(E125=\"\",\"\",Customer!E$7)","v":""},null,"","","",null,{"$f":"CONCATENATE(IF(AND(E125<>\"\",OR(I$9=\"\",J$9=\"\")),VLOOKUP(300,TextID,CODE(Language!$B$4)-64,FALSE),\"\"),IF(AND(E125<>\"\",I125=\"\"),VLOOKUP(302,TextID,CODE(Language!$B$4)-64,FALSE),\"\"),IF(AND(E125=\"\",I125<>\"\"),VLOOKUP(306,TextID,CODE(Language!$B$4)-64,FALSE),\"\"),IF(AND(E125<>\"\",E125=E124),VLOOKUP(308,TextID,CODE(Language!$B$4)-64,FALSE),\"\"),IF(AND(E125<>\"\",LEFT(E125,2)=\"GV\"),VLOOKUP(328,Language!A:F,6,FALSE),\"\"))","v":""},null,""]
[null,null,null,{"$f":"IF(E126=\"\",\"\",Customer!E$7)","v":""},null,"","","",null,{"$f":"CONCATENATE(IF(AND(E126<>\"\",OR(I$9=\"\",J$9=\"\")),VLOOKUP(300,TextID,CODE(Language!$B$4)-64,FALSE),\"\"),IF(AND(E126<>\"\",I126=\"\"),VLOOKUP(302,TextID,CODE(Language!$B$4)-64,FALSE),\"\"),IF(AND(E126=\"\",I126<>\"\"),VLOOKUP(306,TextID,CODE(Language!$B$4)-64,FALSE),\"\"),IF(AND(E126<>\"\",E126=E125),VLOOKUP(308,TextID,CODE(Language!$B$4)-64,FALSE),\"\"),IF(AND(E126<>\"\",LEFT(E126,2)=\"GV\"),VLOOKUP(328,Language!A:F,6,FALSE),\"\"))","v":""},null,""]
[null,null,null,{"$f":"IF(E127=\"\",\"\",Customer!E$7)","v":""},null,"","","",null,{"$f":"CONCATENATE(IF(AND(E127<>\"\",OR(I$9=\"\",J$9=\"\")),VLOOKUP(300,TextID,CODE(Language!$B$4)-64,FALSE),\"\"),IF(AND(E127<>\"\",I127=\"\"),VLOOKUP(302,TextID,CODE(Language!$B$4)-64,FALSE),\"\"),IF(AND(E127=\"\",I127<>\"\"),VLOOKUP(306,TextID,CODE(Language!$B$4)-64,FALSE),\"\"),IF(AND(E127<>\"\",E127=E126),VLOOKUP(308,TextID,CODE(Language!$B$4)-64,FALSE),\"\"),IF(AND(E127<>\"\",LEFT(E127,2)=\"GV\"),VLOOKUP(328,Language!A:F,6,FALSE),\"\"))","v":""},null,""]
[null,null,null,{"$f":"IF(E128=\"\",\"\",Customer!E$7)","v":""},null,"","","",null,{"$f":"CONCATENATE(IF(AND(E128<>\"\",OR(I$9=\"\",J$9=\"\")),VLOOKUP(300,TextID,CODE(Language!$B$4)-64,FALSE),\"\"),IF(AND(E128<>\"\",I128=\"\"),VLOOKUP(302,TextID,CODE(Language!$B$4)-64,FALSE),\"\"),IF(AND(E128=\"\",I128<>\"\"),VLOOKUP(306,TextID,CODE(Language!$B$4)-64,FALSE),\"\"),IF(AND(E128<>\"\",E128=E127),VLOOKUP(308,TextID,CODE(Language!$B$4)-64,FALSE),\"\"),IF(AND(E128<>\"\",LEFT(E128,2)=\"GV\"),VLOOKUP(328,Language!A:F,6,FALSE),\"\"))","v":""},null,""]
[null,null,null,{"$f":"IF(E129=\"\",\"\",Customer!E$7)","v":""},null,"","","",null,{"$f":"CONCATENATE(IF(AND(E129<>\"\",OR(I$9=\"\",J$9=\"\")),VLOOKUP(300,TextID,CODE(Language!$B$4)-64,FALSE),\"\"),IF(AND(E129<>\"\",I129=\"\"),VLOOKUP(302,TextID,CODE(Language!$B$4)-64,FALSE),\"\"),IF(AND(E129=\"\",I129<>\"\"),VLOOKUP(306,TextID,CODE(Language!$B$4)-64,FALSE),\"\"),IF(AND(E129<>\"\",E129=E128),VLOOKUP(308,TextID,CODE(Language!$B$4)-64,FALSE),\"\"),IF(AND(E129<>\"\",LEFT(E129,2)=\"GV\"),VLOOKUP(328,Language!A:F,6,FALSE),\"\"))","v":""},null,""]
[null,null,null,{"$f":"IF(E130=\"\",\"\",Customer!E$7)","v":""},null,"","","",null,{"$f":"CONCATENATE(IF(AND(E130<>\"\",OR(I$9=\"\",J$9=\"\")),VLOOKUP(300,TextID,CODE(Language!$B$4)-64,FALSE),\"\"),IF(AND(E130<>\"\",I130=\"\"),VLOOKUP(302,TextID,CODE(Language!$B$4)-64,FALSE),\"\"),IF(AND(E130=\"\",I130<>\"\"),VLOOKUP(306,TextID,CODE(Language!$B$4)-64,FALSE),\"\"),IF(AND(E130<>\"\",E130=E129),VLOOKUP(308,TextID,CODE(Language!$B$4)-64,FALSE),\"\"),IF(AND(E130<>\"\",LEFT(E130,2)=\"GV\"),VLOOKUP(328,Language!A:F,6,FALSE),\"\"))","v":""},null,""]
[null,null,null,{"$f":"IF(E131=\"\",\"\",Customer!E$7)","v":""},null,"","","",null,{"$f":"CONCATENATE(IF(AND(E131<>\"\",OR(I$9=\"\",J$9=\"\")),VLOOKUP(300,TextID,CODE(Language!$B$4)-64,FALSE),\"\"),IF(AND(E131<>\"\",I131=\"\"),VLOOKUP(302,TextID,CODE(Language!$B$4)-64,FALSE),\"\"),IF(AND(E131=\"\",I131<>\"\"),VLOOKUP(306,TextID,CODE(Language!$B$4)-64,FALSE),\"\"),IF(AND(E131<>\"\",E131=E130),VLOOKUP(308,TextID,CODE(Language!$B$4)-64,FALSE),\"\"),IF(AND(E131<>\"\",LEFT(E131,2)=\"GV\"),VLOOKUP(328,Language!A:F,6,FALSE),\"\"))","v":""},null,""]
[null,null,null,{"$f":"IF(E132=\"\",\"\",Customer!E$7)","v":""},null,"","","",null,{"$f":"CONCATENATE(IF(AND(E132<>\"\",OR(I$9=\"\",J$9=\"\")),VLOOKUP(300,TextID,CODE(Language!$B$4)-64,FALSE),\"\"),IF(AND(E132<>\"\",I132=\"\"),VLOOKUP(302,TextID,CODE(Language!$B$4)-64,FALSE),\"\"),IF(AND(E132=\"\",I132<>\"\"),VLOOKUP(306,TextID,CODE(Language!$B$4)-64,FALSE),\"\"),IF(AND(E132<>\"\",E132=E131),VLOOKUP(308,TextID,CODE(Language!$B$4)-64,FALSE),\"\"),IF(AND(E132<>\"\",LEFT(E132,2)=\"GV\"),VLOOKUP(328,Language!A:F,6,FALSE),\"\"))","v":""},null,""]
[null,null,null,{"$f":"IF(E133=\"\",\"\",Customer!E$7)","v":""},null,"","","",null,{"$f":"CONCATENATE(IF(AND(E133<>\"\",OR(I$9=\"\",J$9=\"\")),VLOOKUP(300,TextID,CODE(Language!$B$4)-64,FALSE),\"\"),IF(AND(E133<>\"\",I133=\"\"),VLOOKUP(302,TextID,CODE(Language!$B$4)-64,FALSE),\"\"),IF(AND(E133=\"\",I133<>\"\"),VLOOKUP(306,TextID,CODE(Language!$B$4)-64,FALSE),\"\"),IF(AND(E133<>\"\",E133=E132),VLOOKUP(308,TextID,CODE(Language!$B$4)-64,FALSE),\"\"),IF(AND(E133<>\"\",LEFT(E133,2)=\"GV\"),VLOOKUP(328,Language!A:F,6,FALSE),\"\"))","v":""},null,""]
[null,null,null,{"$f":"IF(E134=\"\",\"\",Customer!E$7)","v":""},null,"","","",null,{"$f":"CONCATENATE(IF(AND(E134<>\"\",OR(I$9=\"\",J$9=\"\")),VLOOKUP(300,TextID,CODE(Language!$B$4)-64,FALSE),\"\"),IF(AND(E134<>\"\",I134=\"\"),VLOOKUP(302,TextID,CODE(Language!$B$4)-64,FALSE),\"\"),IF(AND(E134=\"\",I134<>\"\"),VLOOKUP(306,TextID,CODE(Language!$B$4)-64,FALSE),\"\"),IF(AND(E134<>\"\",E134=E133),VLOOKUP(308,TextID,CODE(Language!$B$4)-64,FALSE),\"\"),IF(AND(E134<>\"\",LEFT(E134,2)=\"GV\"),VLOOKUP(328,Language!A:F,6,FALSE),\"\"))","v":""},null,""]
[null,null,null,{"$f":"IF(E135=\"\",\"\",Customer!E$7)","v":""},null,"","","",null,{"$f":"CONCATENATE(IF(AND(E135<>\"\",OR(I$9=\"\",J$9=\"\")),VLOOKUP(300,TextID,CODE(Language!$B$4)-64,FALSE),\"\"),IF(AND(E135<>\"\",I135=\"\"),VLOOKUP(302,TextID,CODE(Language!$B$4)-64,FALSE),\"\"),IF(AND(E135=\"\",I135<>\"\"),VLOOKUP(306,TextID,CODE(Language!$B$4)-64,FALSE),\"\"),IF(AND(E135<>\"\",E135=E134),VLOOKUP(308,TextID,CODE(Language!$B$4)-64,FALSE),\"\"),IF(AND(E135<>\"\",LEFT(E135,2)=\"GV\"),VLOOKUP(328,Language!A:F,6,FALSE),\"\"))","v":""},null,""]
[null,null,null,{"$f":"IF(E136=\"\",\"\",Customer!E$7)","v":""},null,"","","",null,{"$f":"CONCATENATE(IF(AND(E136<>\"\",OR(I$9=\"\",J$9=\"\")),VLOOKUP(300,TextID,CODE(Language!$B$4)-64,FALSE),\"\"),IF(AND(E136<>\"\",I136=\"\"),VLOOKUP(302,TextID,CODE(Language!$B$4)-64,FALSE),\"\"),IF(AND(E136=\"\",I136<>\"\"),VLOOKUP(306,TextID,CODE(Language!$B$4)-64,FALSE),\"\"),IF(AND(E136<>\"\",E136=E135),VLOOKUP(308,TextID,CODE(Language!$B$4)-64,FALSE),\"\"),IF(AND(E136<>\"\",LEFT(E136,2)=\"GV\"),VLOOKUP(328,Language!A:F,6,FALSE),\"\"))","v":""},null,""]
[null,null,null,{"$f":"IF(E137=\"\",\"\",Customer!E$7)","v":""},null,"","","",null,{"$f":"CONCATENATE(IF(AND(E137<>\"\",OR(I$9=\"\",J$9=\"\")),VLOOKUP(300,TextID,CODE(Language!$B$4)-64,FALSE),\"\"),IF(AND(E137<>\"\",I137=\"\"),VLOOKUP(302,TextID,CODE(Language!$B$4)-64,FALSE),\"\"),IF(AND(E137=\"\",I137<>\"\"),VLOOKUP(306,TextID,CODE(Language!$B$4)-64,FALSE),\"\"),IF(AND(E137<>\"\",E137=E136),VLOOKUP(308,TextID,CODE(Language!$B$4)-64,FALSE),\"\"),IF(AND(E137<>\"\",LEFT(E137,2)=\"GV\"),VLOOKUP(328,Language!A:F,6,FALSE),\"\"))","v":""},null,""]
[null,null,null,{"$f":"IF(E138=\"\",\"\",Customer!E$7)","v":""},null,"","","",null,{"$f":"CONCATENATE(IF(AND(E138<>\"\",OR(I$9=\"\",J$9=\"\")),VLOOKUP(300,TextID,CODE(Language!$B$4)-64,FALSE),\"\"),IF(AND(E138<>\"\",I138=\"\"),VLOOKUP(302,TextID,CODE(Language!$B$4)-64,FALSE),\"\"),IF(AND(E138=\"\",I138<>\"\"),VLOOKUP(306,TextID,CODE(Language!$B$4)-64,FALSE),\"\"),IF(AND(E138<>\"\",E138=E137),VLOOKUP(308,TextID,CODE(Language!$B$4)-64,FALSE),\"\"),IF(AND(E138<>\"\",LEFT(E138,2)=\"GV\"),VLOOKUP(328,Language!A:F,6,FALSE),\"\"))","v":""},null,""]
[null,null,null,{"$f":"IF(E139=\"\",\"\",Customer!E$7)","v":""},null,"","","",null,{"$f":"CONCATENATE(IF(AND(E139<>\"\",OR(I$9=\"\",J$9=\"\")),VLOOKUP(300,TextID,CODE(Language!$B$4)-64,FALSE),\"\"),IF(AND(E139<>\"\",I139=\"\"),VLOOKUP(302,TextID,CODE(Language!$B$4)-64,FALSE),\"\"),IF(AND(E139=\"\",I139<>\"\"),VLOOKUP(306,TextID,CODE(Language!$B$4)-64,FALSE),\"\"),IF(AND(E139<>\"\",E139=E138),VLOOKUP(308,TextID,CODE(Language!$B$4)-64,FALSE),\"\"),IF(AND(E139<>\"\",LEFT(E139,2)=\"GV\"),VLOOKUP(328,Language!A:F,6,FALSE),\"\"))","v":""},null,""]
[null,null,null,{"$f":"IF(E140=\"\",\"\",Customer!E$7)","v":""},null,"","","",null,{"$f":"CONCATENATE(IF(AND(E140<>\"\",OR(I$9=\"\",J$9=\"\")),VLOOKUP(300,TextID,CODE(Language!$B$4)-64,FALSE),\"\"),IF(AND(E140<>\"\",I140=\"\"),VLOOKUP(302,TextID,CODE(Language!$B$4)-64,FALSE),\"\"),IF(AND(E140=\"\",I140<>\"\"),VLOOKUP(306,TextID,CODE(Language!$B$4)-64,FALSE),\"\"),IF(AND(E140<>\"\",E140=E139),VLOOKUP(308,TextID,CODE(Language!$B$4)-64,FALSE),\"\"),IF(AND(E140<>\"\",LEFT(E140,2)=\"GV\"),VLOOKUP(328,Language!A:F,6,FALSE),\"\"))","v":""},null,""]
[null,null,null,{"$f":"IF(E141=\"\",\"\",Customer!E$7)","v":""},null,"",{"$f":"IF($E141=\"\",\"\",VLOOKUP($E141,Material1b,3))","v":""},{"$f":"IF(E141=\"\",\"\",I$9)","v":""},null,{"$f":"CONCATENATE(IF(AND(E141<>\"\",OR(I$9=\"\",J$9=\"\")),VLOOKUP(300,TextID,CODE(Language!$B$4)-64,FALSE),\"\"),IF(AND(E141<>\"\",I141=\"\"),VLOOKUP(302,TextID,CODE(Language!$B$4)-64,FALSE),\"\"),IF(AND(E141=\"\",I141<>\"\"),VLOOKUP(306,TextID,CODE(Language!$B$4)-64,FALSE),\"\"),IF(AND(E141<>\"\",E141=E140),VLOOKUP(308,TextID,CODE(Language!$B$4)-64,FALSE),\"\"),IF(AND(E141<>\"\",LEFT(E141,2)=\"GV\"),VLOOKUP(328,Language!A:F,6,FALSE),\"\"))","v":""},null,""]
[null,null,null,{"$f":"IF(E142=\"\",\"\",Customer!E$7)","v":""},null,{"$f":"IF($E142=\"\",\"\",VLOOKUP($E142,Material1b,2))","v":""},"","",null,{"$f":"CONCATENATE(IF(AND(E142<>\"\",OR(I$9=\"\",J$9=\"\")),VLOOKUP(300,TextID,CODE(Language!$B$4)-64,FALSE),\"\"),IF(AND(E142<>\"\",I142=\"\"),VLOOKUP(302,TextID,CODE(Language!$B$4)-64,FALSE),\"\"),IF(AND(E142=\"\",I142<>\"\"),VLOOKUP(306,TextID,CODE(Language!$B$4)-64,FALSE),\"\"),IF(AND(E142<>\"\",E142=E141),VLOOKUP(308,TextID,CODE(Language!$B$4)-64,FALSE),\"\"),IF(AND(E142<>\"\",LEFT(E142,2)=\"GV\"),VLOOKUP(328,Language!A:F,6,FALSE),\"\"))","v":""},null,{"$f":"IF(E142=\"\",\"\",I$6)","v":""}]
[null,null,null,{"$f":"IF(E143=\"\",\"\",Customer!E$7)","v":""},null,"","","",null,{"$f":"CONCATENATE(IF(AND(E143<>\"\",OR(I$9=\"\",J$9=\"\")),VLOOKUP(300,TextID,CODE(Language!$B$4)-64,FALSE),\"\"),IF(AND(E143<>\"\",I143=\"\"),VLOOKUP(302,TextID,CODE(Language!$B$4)-64,FALSE),\"\"),IF(AND(E143=\"\",I143<>\"\"),VLOOKUP(306,TextID,CODE(Language!$B$4)-64,FALSE),\"\"),IF(AND(E143<>\"\",E143=E142),VLOOKUP(308,TextID,CODE(Language!$B$4)-64,FALSE),\"\"),IF(AND(E143<>\"\",LEFT(E143,2)=\"GV\"),VLOOKUP(328,Language!A:F,6,FALSE),\"\"))","v":""},null,""]
[null,null,null,{"$f":"IF(E144=\"\",\"\",Customer!E$7)","v":""},null,"","","",null,{"$f":"CONCATENATE(IF(AND(E144<>\"\",OR(I$9=\"\",J$9=\"\")),VLOOKUP(300,TextID,CODE(Language!$B$4)-64,FALSE),\"\"),IF(AND(E144<>\"\",I144=\"\"),VLOOKUP(302,TextID,CODE(Language!$B$4)-64,FALSE),\"\"),IF(AND(E144=\"\",I144<>\"\"),VLOOKUP(306,TextID,CODE(Language!$B$4)-64,FALSE),\"\"),IF(AND(E144<>\"\",E144=E143),VLOOKUP(308,TextID,CODE(Language!$B$4)-64,FALSE),\"\"),IF(AND(E144<>\"\",LEFT(E144,2)=\"GV\"),VLOOKUP(328,Language!A:F,6,FALSE),\"\"))","v":""},null,""]
[null,null,null,{"$f":"IF(E145=\"\",\"\",Customer!E$7)","v":""},null,"","","",null,{"$f":"CONCATENATE(IF(AND(E145<>\"\",OR(I$9=\"\",J$9=\"\")),VLOOKUP(300,TextID,CODE(Language!$B$4)-64,FALSE),\"\"),IF(AND(E145<>\"\",I145=\"\"),VLOOKUP(302,TextID,CODE(Language!$B$4)-64,FALSE),\"\"),IF(AND(E145=\"\",I145<>\"\"),VLOOKUP(306,TextID,CODE(Language!$B$4)-64,FALSE),\"\"),IF(AND(E145<>\"\",E145=E144),VLOOKUP(308,TextID,CODE(Language!$B$4)-64,FALSE),\"\"),IF(AND(E145<>\"\",LEFT(E145,2)=\"GV\"),VLOOKUP(328,Language!A:F,6,FALSE),\"\"))","v":""},null,""]
[null,null,null,{"$f":"IF(E146=\"\",\"\",Customer!E$7)","v":""},null,"","","",null,{"$f":"CONCATENATE(IF(AND(E146<>\"\",OR(I$9=\"\",J$9=\"\")),VLOOKUP(300,TextID,CODE(Language!$B$4)-64,FALSE),\"\"),IF(AND(E146<>\"\",I146=\"\"),VLOOKUP(302,TextID,CODE(Language!$B$4)-64,FALSE),\"\"),IF(AND(E146=\"\",I146<>\"\"),VLOOKUP(306,TextID,CODE(Language!$B$4)-64,FALSE),\"\"),IF(AND(E146<>\"\",E146=E145),VLOOKUP(308,TextID,CODE(Language!$B$4)-64,FALSE),\"\"),IF(AND(E146<>\"\",LEFT(E146,2)=\"GV\"),VLOOKUP(328,Language!A:F,6,FALSE),\"\"))","v":""},null,""]
[null,null,null,{"$f":"IF(E147=\"\",\"\",Customer!E$7)","v":""},null,"","","",null,{"$f":"CONCATENATE(IF(AND(E147<>\"\",OR(I$9=\"\",J$9=\"\")),VLOOKUP(300,TextID,CODE(Language!$B$4)-64,FALSE),\"\"),IF(AND(E147<>\"\",I147=\"\"),VLOOKUP(302,TextID,CODE(Language!$B$4)-64,FALSE),\"\"),IF(AND(E147=\"\",I147<>\"\"),VLOOKUP(306,TextID,CODE(Language!$B$4)-64,FALSE),\"\"),IF(AND(E147<>\"\",E147=E146),VLOOKUP(308,TextID,CODE(Language!$B$4)-64,FALSE),\"\"),IF(AND(E147<>\"\",LEFT(E147,2)=\"GV\"),VLOOKUP(328,Language!A:F,6,FALSE),\"\"))","v":""},null,""]
[null,null,null,{"$f":"IF(E148=\"\",\"\",Customer!E$7)","v":""},null,"","","",null,{"$f":"CONCATENATE(IF(AND(E148<>\"\",OR(I$9=\"\",J$9=\"\")),VLOOKUP(300,TextID,CODE(Language!$B$4)-64,FALSE),\"\"),IF(AND(E148<>\"\",I148=\"\"),VLOOKUP(302,TextID,CODE(Language!$B$4)-64,FALSE),\"\"),IF(AND(E148=\"\",I148<>\"\"),VLOOKUP(306,TextID,CODE(Language!$B$4)-64,FALSE),\"\"),IF(AND(E148<>\"\",E148=E147),VLOOKUP(308,TextID,CODE(Language!$B$4)-64,FALSE),\"\"),IF(AND(E148<>\"\",LEFT(E148,2)=\"GV\"),VLOOKUP(328,Language!A:F,6,FALSE),\"\"))","v":""},null,""]
[null,null,null,{"$f":"IF(E149=\"\",\"\",Customer!E$7)","v":""},null,"","","",null,{"$f":"CONCATENATE(IF(AND(E149<>\"\",OR(I$9=\"\",J$9=\"\")),VLOOKUP(300,TextID,CODE(Language!$B$4)-64,FALSE),\"\"),IF(AND(E149<>\"\",I149=\"\"),VLOOKUP(302,TextID,CODE(Language!$B$4)-64,FALSE),\"\"),IF(AND(E149=\"\",I149<>\"\"),VLOOKUP(306,TextID,CODE(Language!$B$4)-64,FALSE),\"\"),IF(AND(E149<>\"\",E149=E148),VLOOKUP(308,TextID,CODE(Language!$B$4)-64,FALSE),\"\"),IF(AND(E149<>\"\",LEFT(E149,2)=\"GV\"),VLOOKUP(328,Language!A:F,6,FALSE),\"\"))","v":""},null,""]
[null,null,null,{"$f":"IF(E150=\"\",\"\",Customer!E$7)","v":""},null,"","","",null,{"$f":"CONCATENATE(IF(AND(E150<>\"\",OR(I$9=\"\",J$9=\"\")),VLOOKUP(300,TextID,CODE(Language!$B$4)-64,FALSE),\"\"),IF(AND(E150<>\"\",I150=\"\"),VLOOKUP(302,TextID,CODE(Language!$B$4)-64,FALSE),\"\"),IF(AND(E150=\"\",I150<>\"\"),VLOOKUP(306,TextID,CODE(Language!$B$4)-64,FALSE),\"\"),IF(AND(E150<>\"\",E150=E149),VLOOKUP(308,TextID,CODE(Language!$B$4)-64,FALSE),\"\"),IF(AND(E150<>\"\",LEFT(E150,2)=\"GV\"),VLOOKUP(328,Language!A:F,6,FALSE),\"\"))","v":""},null,""]
[null,null,null,{"$f":"IF(E151=\"\",\"\",Customer!E$7)","v":""},null,"","","",null,{"$f":"CONCATENATE(IF(AND(E151<>\"\",OR(I$9=\"\",J$9=\"\")),VLOOKUP(300,TextID,CODE(Language!$B$4)-64,FALSE),\"\"),IF(AND(E151<>\"\",I151=\"\"),VLOOKUP(302,TextID,CODE(Language!$B$4)-64,FALSE),\"\"),IF(AND(E151=\"\",I151<>\"\"),VLOOKUP(306,TextID,CODE(Language!$B$4)-64,FALSE),\"\"),IF(AND(E151<>\"\",E151=E150),VLOOKUP(308,TextID,CODE(Language!$B$4)-64,FALSE),\"\"),IF(AND(E151<>\"\",LEFT(E151,2)=\"GV\"),VLOOKUP(328,Language!A:F,6,FALSE),\"\"))","v":""},null,""]
[null,null,null,{"$f":"IF(E152=\"\",\"\",Customer!E$7)","v":""},null,"","","",null,{"$f":"CONCATENATE(IF(AND(E152<>\"\",OR(I$9=\"\",J$9=\"\")),VLOOKUP(300,TextID,CODE(Language!$B$4)-64,FALSE),\"\"),IF(AND(E152<>\"\",I152=\"\"),VLOOKUP(302,TextID,CODE(Language!$B$4)-64,FALSE),\"\"),IF(AND(E152=\"\",I152<>\"\"),VLOOKUP(306,TextID,CODE(Language!$B$4)-64,FALSE),\"\"),IF(AND(E152<>\"\",E152=E151),VLOOKUP(308,TextID,CODE(Language!$B$4)-64,FALSE),\"\"),IF(AND(E152<>\"\",LEFT(E152,2)=\"GV\"),VLOOKUP(328,Language!A:F,6,FALSE),\"\"))","v":""},null,""]
[null,null,null,{"$f":"IF(E153=\"\",\"\",Customer!E$7)","v":""},null,"","","",null,{"$f":"CONCATENATE(IF(AND(E153<>\"\",OR(I$9=\"\",J$9=\"\")),VLOOKUP(300,TextID,CODE(Language!$B$4)-64,FALSE),\"\"),IF(AND(E153<>\"\",I153=\"\"),VLOOKUP(302,TextID,CODE(Language!$B$4)-64,FALSE),\"\"),IF(AND(E153=\"\",I153<>\"\"),VLOOKUP(306,TextID,CODE(Language!$B$4)-64,FALSE),\"\"),IF(AND(E153<>\"\",E153=E152),VLOOKUP(308,TextID,CODE(Language!$B$4)-64,FALSE),\"\"),IF(AND(E153<>\"\",LEFT(E153,2)=\"GV\"),VLOOKUP(328,Language!A:F,6,FALSE),\"\"))","v":""},null,""]
[null,null,null,{"$f":"IF(E154=\"\",\"\",Customer!E$7)","v":""},null,"","","",null,{"$f":"CONCATENATE(IF(AND(E154<>\"\",OR(I$9=\"\",J$9=\"\")),VLOOKUP(300,TextID,CODE(Language!$B$4)-64,FALSE),\"\"),IF(AND(E154<>\"\",I154=\"\"),VLOOKUP(302,TextID,CODE(Language!$B$4)-64,FALSE),\"\"),IF(AND(E154=\"\",I154<>\"\"),VLOOKUP(306,TextID,CODE(Language!$B$4)-64,FALSE),\"\"),IF(AND(E154<>\"\",E154=E153),VLOOKUP(308,TextID,CODE(Language!$B$4)-64,FALSE),\"\"),IF(AND(E154<>\"\",LEFT(E154,2)=\"GV\"),VLOOKUP(328,Language!A:F,6,FALSE),\"\"))","v":""},null,""]
[null,null,null,{"$f":"IF(E155=\"\",\"\",Customer!E$7)","v":""},null,"","","",null,{"$f":"CONCATENATE(IF(AND(E155<>\"\",OR(I$9=\"\",J$9=\"\")),VLOOKUP(300,TextID,CODE(Language!$B$4)-64,FALSE),\"\"),IF(AND(E155<>\"\",I155=\"\"),VLOOKUP(302,TextID,CODE(Language!$B$4)-64,FALSE),\"\"),IF(AND(E155=\"\",I155<>\"\"),VLOOKUP(306,TextID,CODE(Language!$B$4)-64,FALSE),\"\"),IF(AND(E155<>\"\",E155=E154),VLOOKUP(308,TextID,CODE(Language!$B$4)-64,FALSE),\"\"),IF(AND(E155<>\"\",LEFT(E155,2)=\"GV\"),VLOOKUP(328,Language!A:F,6,FALSE),\"\"))","v":""},null,""]
[null,null,null,{"$f":"IF(E156=\"\",\"\",Customer!E$7)","v":""},null,"","","",null,{"$f":"CONCATENATE(IF(AND(E156<>\"\",OR(I$9=\"\",J$9=\"\")),VLOOKUP(300,TextID,CODE(Language!$B$4)-64,FALSE),\"\"),IF(AND(E156<>\"\",I156=\"\"),VLOOKUP(302,TextID,CODE(Language!$B$4)-64,FALSE),\"\"),IF(AND(E156=\"\",I156<>\"\"),VLOOKUP(306,TextID,CODE(Language!$B$4)-64,FALSE),\"\"),IF(AND(E156<>\"\",E156=E155),VLOOKUP(308,TextID,CODE(Language!$B$4)-64,FALSE),\"\"),IF(AND(E156<>\"\",LEFT(E156,2)=\"GV\"),VLOOKUP(328,Language!A:F,6,FALSE),\"\"))","v":""},null,""]
[null,null,null,{"$f":"IF(E157=\"\",\"\",Customer!E$7)","v":""},null,"","","",null,{"$f":"CONCATENATE(IF(AND(E157<>\"\",OR(I$9=\"\",J$9=\"\")),VLOOKUP(300,TextID,CODE(Language!$B$4)-64,FALSE),\"\"),IF(AND(E157<>\"\",I157=\"\"),VLOOKUP(302,TextID,CODE(Language!$B$4)-64,FALSE),\"\"),IF(AND(E157=\"\",I157<>\"\"),VLOOKUP(306,TextID,CODE(Language!$B$4)-64,FALSE),\"\"),IF(AND(E157<>\"\",E157=E156),VLOOKUP(308,TextID,CODE(Language!$B$4)-64,FALSE),\"\"),IF(AND(E157<>\"\",LEFT(E157,2)=\"GV\"),VLOOKUP(328,Language!A:F,6,FALSE),\"\"))","v":""},null,""]
[null,null,null,{"$f":"IF(E158=\"\",\"\",Customer!E$7)","v":""},null,"","","",null,{"$f":"CONCATENATE(IF(AND(E158<>\"\",OR(I$9=\"\",J$9=\"\")),VLOOKUP(300,TextID,CODE(Language!$B$4)-64,FALSE),\"\"),IF(AND(E158<>\"\",I158=\"\"),VLOOKUP(302,TextID,CODE(Language!$B$4)-64,FALSE),\"\"),IF(AND(E158=\"\",I158<>\"\"),VLOOKUP(306,TextID,CODE(Language!$B$4)-64,FALSE),\"\"),IF(AND(E158<>\"\",E158=E157),VLOOKUP(308,TextID,CODE(Language!$B$4)-64,FALSE),\"\"),IF(AND(E158<>\"\",LEFT(E158,2)=\"GV\"),VLOOKUP(328,Language!A:F,6,FALSE),\"\"))","v":""},null,""]
[null,null,null,{"$f":"IF(E159=\"\",\"\",Customer!E$7)","v":""},null,"","","",null,{"$f":"CONCATENATE(IF(AND(E159<>\"\",OR(I$9=\"\",J$9=\"\")),VLOOKUP(300,TextID,CODE(Language!$B$4)-64,FALSE),\"\"),IF(AND(E159<>\"\",I159=\"\"),VLOOKUP(302,TextID,CODE(Language!$B$4)-64,FALSE),\"\"),IF(AND(E159=\"\",I159<>\"\"),VLOOKUP(306,TextID,CODE(Language!$B$4)-64,FALSE),\"\"),IF(AND(E159<>\"\",E159=E158),VLOOKUP(308,TextID,CODE(Language!$B$4)-64,FALSE),\"\"),IF(AND(E159<>\"\",LEFT(E159,2)=\"GV\"),VLOOKUP(328,Language!A:F,6,FALSE),\"\"))","v":""},null,""]
[null,null,null,{"$f":"IF(E160=\"\",\"\",Customer!E$7)","v":""},null,"","","",null,{"$f":"CONCATENATE(IF(AND(E160<>\"\",OR(I$9=\"\",J$9=\"\")),VLOOKUP(300,TextID,CODE(Language!$B$4)-64,FALSE),\"\"),IF(AND(E160<>\"\",I160=\"\"),VLOOKUP(302,TextID,CODE(Language!$B$4)-64,FALSE),\"\"),IF(AND(E160=\"\",I160<>\"\"),VLOOKUP(306,TextID,CODE(Language!$B$4)-64,FALSE),\"\"),IF(AND(E160<>\"\",E160=E159),VLOOKUP(308,TextID,CODE(Language!$B$4)-64,FALSE),\"\"),IF(AND(E160<>\"\",LEFT(E160,2)=\"GV\"),VLOOKUP(328,Language!A:F,6,FALSE),\"\"))","v":""},null,""]
[null,null,null,{"$f":"IF(E161=\"\",\"\",Customer!E$7)","v":""},null,"","","",null,{"$f":"CONCATENATE(IF(AND(E161<>\"\",OR(I$9=\"\",J$9=\"\")),VLOOKUP(300,TextID,CODE(Language!$B$4)-64,FALSE),\"\"),IF(AND(E161<>\"\",I161=\"\"),VLOOKUP(302,TextID,CODE(Language!$B$4)-64,FALSE),\"\"),IF(AND(E161=\"\",I161<>\"\"),VLOOKUP(306,TextID,CODE(Language!$B$4)-64,FALSE),\"\"),IF(AND(E161<>\"\",E161=E160),VLOOKUP(308,TextID,CODE(Language!$B$4)-64,FALSE),\"\"),IF(AND(E161<>\"\",LEFT(E161,2)=\"GV\"),VLOOKUP(328,Language!A:F,6,FALSE),\"\"))","v":""},null,""]
[null,null,null,{"$f":"IF(E162=\"\",\"\",Customer!E$7)","v":""},null,"","","",null,{"$f":"CONCATENATE(IF(AND(E162<>\"\",OR(I$9=\"\",J$9=\"\")),VLOOKUP(300,TextID,CODE(Language!$B$4)-64,FALSE),\"\"),IF(AND(E162<>\"\",I162=\"\"),VLOOKUP(302,TextID,CODE(Language!$B$4)-64,FALSE),\"\"),IF(AND(E162=\"\",I162<>\"\"),VLOOKUP(306,TextID,CODE(Language!$B$4)-64,FALSE),\"\"),IF(AND(E162<>\"\",E162=E161),VLOOKUP(308,TextID,CODE(Language!$B$4)-64,FALSE),\"\"),IF(AND(E162<>\"\",LEFT(E162,2)=\"GV\"),VLOOKUP(328,Language!A:F,6,FALSE),\"\"))","v":""},null,""]

{"sheet":"Report2","index":11,"n_rows":162,"n_cols":12,"rows_kept":162,"cut":false,"hidden":false,"merged":[]}
[]
[]
[]
[]
[null,null,{"$f":"VLOOKUP(218,TextID,CODE(Language!$B$4)-64,FALSE)","v":"Meldeformular Rollläden"},null,null,null,null,null,null,{"$f":"IF(OR(Customer!E7=\"\",Customer!E8=\"\"),VLOOKUP(304,TextID,CODE(Language!$B$4)-64,FALSE),CONCATENATE(Customer!E7,\" \",LEFT(Customer!E8,30)))","v":"Kundenname und/oder Nummer fehlt "}]
[null,null,null,null,null,{"$f":"VLOOKUP(326,TextID,CODE(Language!$B$4)-64,FALSE)","v":"* Zählung am:"},null,null,{"$f":"IF(Report1!I6=\"\",\"\",Report1!I6)","v":""}]
[null,null,null,null,null,{"$f":"VLOOKUP(226,TextID,CODE(Language!$B$4)-64,FALSE)","v":"* Meldung:"},null,null,{"$f":"IF(Report1!I7=\"\",\"\",Report1!I7)","v":""},{"$f":"VLOOKUP(170,TextID,CODE(Language!$B$4)-64,FALSE)","v":"* Eingabe erforderlich"}]
[null,null,null,null,null,{"$f":"VLOOKUP(228,TextID,CODE(Language!$B$4)-64,FALSE)","v":"* Jahr:"},null,null,{"$f":"IF(Report1!I8=\"\",\"\",Report1!I8)","v":2024}]
[]
[null,null,null,null,null,{"$f":"VLOOKUP(172,TextID,CODE(Language!$B$4)-64,FALSE)","v":"Total:"},null,null,{"$f":"SUM(I13:I162)","v":0}]
[null,null,null,null,"Artikelnummer *","Gruppe","Einheit",null,"* Bestand","Status"]
[null,null,null,"CustNo","Material","MatType","UM","StockDate","StockQty","Status"]
[null,null,null,{"$f":"IF(E13=\"\",\"\",Customer!E$7)","v":""},null,{"$f":"IF($E13=\"\",\"\",VLOOKUP($E13,Material2b,2))","v":""},{"$f":"IF($E13=\"\",\"\",VLOOKUP($E13,Material2b,3))","v":""},{"$f":"IF(E13=\"\",\"\",Report1!I$9)","v":""},null,{"$f":"CONCATENATE(IF(AND(E13<>\"\",OR(Report1!I$9=\"\",Report1!J$9=\"\")),VLOOKUP(300,TextID,CODE(Language!$B$4)-64,FALSE),\"\"),IF(AND(E13<>\"\",I13=\"\"),VLOOKUP(302,TextID,CODE(Language!$B$4)-64,FALSE),\"\"),IF(AND(E13=\"\",I13<>\"\"),VLOOKUP(306,TextID,CODE(Language!$B$4)-64,FALSE),\"\"),IF(AND(E13<>\"\",E13=E12),VLOOKUP(308,TextID,CODE(Language!$B$4)-64,FALSE),\"\"))","v":""},null,{"$f":"IF(E13=\"\",\"\",Report1!I$6)","v":""}]
[null,null,null,{"$f":"IF(E14=\"\",\"\",Customer!E$7)","v":""},null,"","",{"$f":"IF(E14=\"\",\"\",Report1!I$9)","v":""},null,{"$f":"CONCATENATE(IF(AND(E14<>\"\",OR(Report1!I$9=\"\",Report1!J$9=\"\")),VLOOKUP(300,TextID,CODE(Language!$B$4)-64,FALSE),\"\"),IF(AND(E14<>\"\",I14=\"\"),VLOOKUP(302,TextID,CODE(Language!$B$4)-64,FALSE),\"\"),IF(AND(E14=\"\",I14<>\"\"),VLOOKUP(306,TextID,CODE(Language!$B$4)-64,FALSE),\"\"),IF(AND(E14<>\"\",E14=E13),VLOOKUP(308,TextID,CODE(Language!$B$4)-64,FALSE),\"\"))","v":""},null,{"$f":"IF(E14=\"\",\"\",Report1!I$6)","v":""}]
[null,null,null,{"$f":"IF(E15=\"\",\"\",Customer!E$7)","v":""},null,"","",{"$f":"IF(E15=\"\",\"\",Report1!I$9)","v":""},null,{"$f":"CONCATENATE(IF(AND(E15<>\"\",OR(Report1!I$9=\"\",Report1!J$9=\"\")),VLOOKUP(300,TextID,CODE(Language!$B$4)-64,FALSE),\"\"),IF(AND(E15<>\"\",I15=\"\"),VLOOKUP(302,TextID,CODE(Language!$B$4)-64,FALSE),\"\"),IF(AND(E15=\"\",I15<>\"\"),VLOOKUP(306,TextID,CODE(Language!$B$4)-64,FALSE),\"\"),IF(AND(E15<>\"\",E15=E14),VLOOKUP(308,TextID,CODE(Language!$B$4)-64,FALSE),\"\"))","v":""},null,{"$f":"IF(E15=\"\",\"\",Report1!I$6)","v":""}]
[null,null,null,{"$f":"IF(E16=\"\",\"\",Customer!E$7)","v":""},null,"","",{"$f":"IF(E16=\"\",\"\",Report1!I$9)","v":""},null,{"$f":"CONCATENATE(IF(AND(E16<>\"\",OR(Report1!I$9=\"\",Report1!J$9=\"\")),VLOOKUP(300,TextID,CODE(Language!$B$4)-64,FALSE),\"\"),IF(AND(E16<>\"\",I16=\"\"),VLOOKUP(302,TextID,CODE(Language!$B$4)-64,FALSE),\"\"),IF(AND(E16=\"\",I16<>\"\"),VLOOKUP(306,TextID,CODE(Language!$B$4)-64,FALSE),\"\"),IF(AND(E16<>\"\",E16=E15),VLOOKUP(308,TextID,CODE(Language!$B$4)-64,FALSE),\"\"))","v":""},null,{"$f":"IF(E16=\"\",\"\",Report1!I$6)","v":""}]
[null,null,null,{"$f":"IF(E17=\"\",\"\",Customer!E$7)","v":""},null,"","",{"$f":"IF(E17=\"\",\"\",Report1!I$9)","v":""},null,{"$f":"CONCATENATE(IF(AND(E17<>\"\",OR(Report1!I$9=\"\",Report1!J$9=\"\")),VLOOKUP(300,TextID,CODE(Language!$B$4)-64,FALSE),\"\"),IF(AND(E17<>\"\",I17=\"\"),VLOOKUP(302,TextID,CODE(Language!$B$4)-64,FALSE),\"\"),IF(AND(E17=\"\",I17<>\"\"),VLOOKUP(306,TextID,CODE(Language!$B$4)-64,FALSE),\"\"),IF(AND(E17<>\"\",E17=E16),VLOOKUP(308,TextID,CODE(Language!$B$4)-64,FALSE),\"\"))","v":""},null,{"$f":"IF(E17=\"\",\"\",Report1!I$6)","v":""}]
[null,null,null,{"$f":"IF(E18=\"\",\"\",Customer!E$7)","v":""},null,"","",{"$f":"IF(E18=\"\",\"\",Report1!I$9)","v":""},null,{"$f":"CONCATENATE(IF(AND(E18<>\"\",OR(Report1!I$9=\"\",Report1!J$9=\"\")),VLOOKUP(300,TextID,CODE(Language!$B$4)-64,FALSE),\"\"),IF(AND(E18<>\"\",I18=\"\"),VLOOKUP(302,TextID,CODE(Language!$B$4)-64,FALSE),\"\"),IF(AND(E18=\"\",I18<>\"\"),VLOOKUP(306,TextID,CODE(Language!$B$4)-64,FALSE),\"\"),IF(AND(E18<>\"\",E18=E17),VLOOKUP(308,TextID,CODE(Language!$B$4)-64,FALSE),\"\"))","v":""},null,{"$f":"IF(E18=\"\",\"\",Report1!I$6)","v":""}]
[null,null,null,{"$f":"IF(E19=\"\",\"\",Customer!E$7)","v":""},null,"","",{"$f":"IF(E19=\"\",\"\",Report1!I$9)","v":""},null,{"$f":"CONCATENATE(IF(AND(E19<>\"\",OR(Report1!I$9=\"\",Report1!J$9=\"\")),VLOOKUP(300,TextID,CODE(Language!$B$4)-64,FALSE),\"\"),IF(AND(E19<>\"\",I19=\"\"),VLOOKUP(302,TextID,CODE(Language!$B$4)-64,FALSE),\"\"),IF(AND(E19=\"\",I19<>\"\"),VLOOKUP(306,TextID,CODE(Language!$B$4)-64,FALSE),\"\"),IF(AND(E19<>\"\",E19=E18),VLOOKUP(308,TextID,CODE(Language!$B$4)-64,FALSE),\"\"))","v":""},null,{"$f":"IF(E19=\"\",\"\",Report1!I$6)","v":""}]
[null,null,null,{"$f":"IF(E20=\"\",\"\",Customer!E$7)","v":""},null,"","",{"$f":"IF(E20=\"\",\"\",Report1!I$9)","v":""},null,{"$f":"CONCATENATE(IF(AND(E20<>\"\",OR(Report1!I$9=\"\",Report1!J$9=\"\")),VLOOKUP(300,TextID,CODE(Language!$B$4)-64,FALSE),\"\"),IF(AND(E20<>\"\",I20=\"\"),VLOOKUP(302,TextID,CODE(Language!$B$4)-64,FALSE),\"\"),IF(AND(E20=\"\",I20<>\"\"),VLOOKUP(306,TextID,CODE(Language!$B$4)-64,FALSE),\"\"),IF(AND(E20<>\"\",E20=E19),VLOOKUP(308,TextID,CODE(Language!$B$4)-64,FALSE),\"\"))","v":""},null,{"$f":"IF(E20=\"\",\"\",Report1!I$6)","v":""}]
[null,null,null,{"$f":"IF(E21=\"\",\"\",Customer!E$7)","v":""},null,"","",{"$f":"IF(E21=\"\",\"\",Report1!I$9)","v":""},null,{"$f":"CONCATENATE(IF(AND(E21<>\"\",OR(Report1!I$9=\"\",Report1!J$9=\"\")),VLOOKUP(300,TextID,CODE(Language!$B$4)-64,FALSE),\"\"),IF(AND(E21<>\"\",I21=\"\"),VLOOKUP(302,TextID,CODE(Language!$B$4)-64,FALSE),\"\"),IF(AND(E21=\"\",I21<>\"\"),VLOOKUP(306,TextID,CODE(Language!$B$4)-64,FALSE),\"\"),IF(AND(E21<>\"\",E21=E20),VLOOKUP(308,TextID,CODE(Language!$B$4)-64,FALSE),\"\"))","v":""},null,{"$f":"IF(E21=\"\",\"\",Report1!I$6)","v":""}]
[null,null,null,{"$f":"IF(E22=\"\",\"\",Customer!E$7)","v":""},null,"","",{"$f":"IF(E22=\"\",\"\",Report1!I$9)","v":""},null,{"$f":"CONCATENATE(IF(AND(E22<>\"\",OR(Report1!I$9=\"\",Report1!J$9=\"\")),VLOOKUP(300,TextID,CODE(Language!$B$4)-64,FALSE),\"\"),IF(AND(E22<>\"\",I22=\"\"),VLOOKUP(302,TextID,CODE(Language!$B$4)-64,FALSE),\"\"),IF(AND(E22=\"\",I22<>\"\"),VLOOKUP(306,TextID,CODE(Language!$B$4)-64,FALSE),\"\"),IF(AND(E22<>\"\",E22=E21),VLOOKUP(308,TextID,CODE(Language!$B$4)-64,FALSE),\"\"))","v":""},null,{"$f":"IF(E22=\"\",\"\",Report1!I$6)","v":""}]
[null,null,null,{"$f":"IF(E23=\"\",\"\",Customer!E$7)","v":""},null,"","",{"$f":"IF(E23=\"\",\"\",Report1!I$9)","v":""},null,{"$f":"CONCATENATE(IF(AND(E23<>\"\",OR(Report1!I$9=\"\",Report1!J$9=\"\")),VLOOKUP(300,TextID,CODE(Language!$B$4)-64,FALSE),\"\"),IF(AND(E23<>\"\",I23=\"\"),VLOOKUP(302,TextID,CODE(Language!$B$4)-64,FALSE),\"\"),IF(AND(E23=\"\",I23<>\"\"),VLOOKUP(306,TextID,CODE(Language!$B$4)-64,FALSE),\"\"),IF(AND(E23<>\"\",E23=E22),VLOOKUP(308,TextID,CODE(Language!$B$4)-64,FALSE),\"\"))","v":""},null,{"$f":"IF(E23=\"\",\"\",Report1!I$6)","v":""}]
[null,null,null,{"$f":"IF(E24=\"\",\"\",Customer!E$7)","v":""},null,"","",{"$f":"IF(E24=\"\",\"\",Report1!I$9)","v":""},null,{"$f":"CONCATENATE(IF(AND(E24<>\"\",OR(Report1!I$9=\"\",Report1!J$9=\"\")),VLOOKUP(300,TextID,CODE(Language!$B$4)-64,FALSE),\"\"),IF(AND(E24<>\"\",I24=\"\"),VLOOKUP(302,TextID,CODE(Language!$B$4)-64,FALSE),\"\"),IF(AND(E24=\"\",I24<>\"\"),VLOOKUP(306,TextID,CODE(Language!$B$4)-64,FALSE),\"\"),IF(AND(E24<>\"\",E24=E23),VLOOKUP(308,TextID,CODE(Language!$B$4)-64,FALSE),\"\"))","v":""},null,{"$f":"IF(E24=\"\",\"\",Report1!I$6)","v":""}]
[null,null,null,{"$f":"IF(E25=\"\",\"\",Customer!E$7)","v":""},null,"","",{"$f":"IF(E25=\"\",\"\",Report1!I$9)","v":""},null,{"$f":"CONCATENATE(IF(AND(E25<>\"\",OR(Report1!I$9=\"\",Report1!J$9=\"\")),VLOOKUP(300,TextID,CODE(Language!$B$4)-64,FALSE),\"\"),IF(AND(E25<>\"\",I25=\"\"),VLOOKUP(302,TextID,CODE(Language!$B$4)-64,FALSE),\"\"),IF(AND(E25=\"\",I25<>\"\"),VLOOKUP(306,TextID,CODE(Language!$B$4)-64,FALSE),\"\"),IF(AND(E25<>\"\",E25=E24),VLOOKUP(308,TextID,CODE(Language!$B$4)-64,FALSE),\"\"))","v":""},null,{"$f":"IF(E25=\"\",\"\",Report1!I$6)","v":""}]
[null,null,null,{"$f":"IF(E26=\"\",\"\",Customer!E$7)","v":""},null,"","",{"$f":"IF(E26=\"\",\"\",Report1!I$9)","v":""},null,{"$f":"CONCATENATE(IF(AND(E26<>\"\",OR(Report1!I$9=\"\",Report1!J$9=\"\")),VLOOKUP(300,TextID,CODE(Language!$B$4)-64,FALSE),\"\"),IF(AND(E26<>\"\",I26=\"\"),VLOOKUP(302,TextID,CODE(Language!$B$4)-64,FALSE),\"\"),IF(AND(E26=\"\",I26<>\"\"),VLOOKUP(306,TextID,CODE(Language!$B$4)-64,FALSE),\"\"),IF(AND(E26<>\"\",E26=E25),VLOOKUP(308,TextID,CODE(Language!$B$4)-64,FALSE),\"\"))","v":""},null,{"$f":"IF(E26=\"\",\"\",Report1!I$6)","v":""}]
[null,null,null,{"$f":"IF(E27=\"\",\"\",Customer!E$7)","v":""},null,"","",{"$f":"IF(E27=\"\",\"\",Report1!I$9)","v":""},null,{"$f":"CONCATENATE(IF(AND(E27<>\"\",OR(Report1!I$9=\"\",Report1!J$9=\"\")),VLOOKUP(300,TextID,CODE(Language!$B$4)-64,FALSE),\"\"),IF(AND(E27<>\"\",I27=\"\"),VLOOKUP(302,TextID,CODE(Language!$B$4)-64,FALSE),\"\"),IF(AND(E27=\"\",I27<>\"\"),VLOOKUP(306,TextID,CODE(Language!$B$4)-64,FALSE),\"\"),IF(AND(E27<>\"\",E27=E26),VLOOKUP(308,TextID,CODE(Language!$B$4)-64,FALSE),\"\"))","v":""},null,{"$f":"IF(E27=\"\",\"\",Report1!I$6)","v":""}]
[null,null,null,{"$f":"IF(E28=\"\",\"\",Customer!E$7)","v":""},null,"","",{"$f":"IF(E28=\"\",\"\",Report1!I$9)","v":""},null,{"$f":"CONCATENATE(IF(AND(E28<>\"\",OR(Report1!I$9=\"\",Report1!J$9=\"\")),VLOOKUP(300,TextID,CODE(Language!$B$4)-64,FALSE),\"\"),IF(AND(E28<>\"\",I28=\"\"),VLOOKUP(302,TextID,CODE(Language!$B$4)-64,FALSE),\"\"),IF(AND(E28=\"\",I28<>\"\"),VLOOKUP(306,TextID,CODE(Language!$B$4)-64,FALSE),\"\"),IF(AND(E28<>\"\",E28=E27),VLOOKUP(308,TextID,CODE(Language!$B$4)-64,FALSE),\"\"))","v":""},null,{"$f":"IF(E28=\"\",\"\",Report1!I$6)","v":""}]
[null,null,null,{"$f":"IF(E29=\"\",\"\",Customer!E$7)","v":""},null,"","",{"$f":"IF(E29=\"\",\"\",Report1!I$9)","v":""},null,{"$f":"CONCATENATE(IF(AND(E29<>\"\",OR(Report1!I$9=\"\",Report1!J$9=\"\")),VLOOKUP(300,TextID,CODE(Language!$B$4)-64,FALSE),\"\"),IF(AND(E29<>\"\",I29=\"\"),VLOOKUP(302,TextID,CODE(Language!$B$4)-64,FALSE),\"\"),IF(AND(E29=\"\",I29<>\"\"),VLOOKUP(306,TextID,CODE(Language!$B$4)-64,FALSE),\"\"),IF(AND(E29<>\"\",E29=E28),VLOOKUP(308,TextID,CODE(Language!$B$4)-64,FALSE),\"\"))","v":""},null,{"$f":"IF(E29=\"\",\"\",Report1!I$6)","v":""}]
[null,null,null,{"$f":"IF(E30=\"\",\"\",Customer!E$7)","v":""},null,"","",{"$f":"IF(E30=\"\",\"\",Report1!I$9)","v":""},null,{"$f":"CONCATENATE(IF(AND(E30<>\"\",OR(Report1!I$9=\"\",Report1!J$9=\"\")),VLOOKUP(300,TextID,CODE(Language!$B$4)-64,FALSE),\"\"),IF(AND(E30<>\"\",I30=\"\"),VLOOKUP(302,TextID,CODE(Language!$B$4)-64,FALSE),\"\"),IF(AND(E30=\"\",I30<>\"\"),VLOOKUP(306,TextID,CODE(Language!$B$4)-64,FALSE),\"\"),IF(AND(E30<>\"\",E30=E29),VLOOKUP(308,TextID,CODE(Language!$B$4)-64,FALSE),\"\"))","v":""},null,{"$f":"IF(E30=\"\",\"\",Report1!I$6)","v":""}]
[null,null,null,{"$f":"IF(E31=\"\",\"\",Customer!E$7)","v":""},null,"","",{"$f":"IF(E31=\"\",\"\",Report1!I$9)","v":""},null,{"$f":"CONCATENATE(IF(AND(E31<>\"\",OR(Report1!I$9=\"\",Report1!J$9=\"\")),VLOOKUP(300,TextID,CODE(Language!$B$4)-64,FALSE),\"\"),IF(AND(E31<>\"\",I31=\"\"),VLOOKUP(302,TextID,CODE(Language!$B$4)-64,FALSE),\"\"),IF(AND(E31=\"\",I31<>\"\"),VLOOKUP(306,TextID,CODE(Language!$B$4)-64,FALSE),\"\"),IF(AND(E31<>\"\",E31=E30),VLOOKUP(308,TextID,CODE(Language!$B$4)-64,FALSE),\"\"))","v":""},null,{"$f":"IF(E31=\"\",\"\",Report1!I$6)","v":""}]
[null,null,null,{"$f":"IF(E32=\"\",\"\",Customer!E$7)","v":""},null,"","",{"$f":"IF(E32=\"\",\"\",Report1!I$9)","v":""},null,{"$f":"CONCATENATE(IF(AND(E32<>\"\",OR(Report1!I$9=\"\",Report1!J$9=\"\")),VLOOKUP(300,TextID,CODE(Language!$B$4)-64,FALSE),\"\"),IF(AND(E32<>\"\",I32=\"\"),VLOOKUP(302,TextID,CODE(Language!$B$4)-64,FALSE),\"\"),IF(AND(E32=\"\",I32<>\"\"),VLOOKUP(306,TextID,CODE(Language!$B$4)-64,FALSE),\"\"),IF(AND(E32<>\"\",E32=E31),VLOOKUP(308,TextID,CODE(Language!$B$4)-64,FALSE),\"\"))","v":""},null,{"$f":"IF(E32=\"\",\"\",Report1!I$6)","v":""}]
[null,null,null,{"$f":"IF(E33=\"\",\"\",Customer!E$7)","v":""},null,"","",{"$f":"IF(E33=\"\",\"\",Report1!I$9)","v":""},null,{"$f":"CONCATENATE(IF(AND(E33<>\"\",OR(Report1!I$9=\"\",Report1!J$9=\"\")),VLOOKUP(300,TextID,CODE(Language!$B$4)-64,FALSE),\"\"),IF(AND(E33<>\"\",I33=\"\"),VLOOKUP(302,TextID,CODE(Language!$B$4)-64,FALSE),\"\"),IF(AND(E33=\"\",I33<>\"\"),VLOOKUP(306,TextID,CODE(Language!$B$4)-64,FALSE),\"\"),IF(AND(E33<>\"\",E33=E32),VLOOKUP(308,TextID,CODE(Language!$B$4)-64,FALSE),\"\"))","v":""},null,{"$f":"IF(E33=\"\",\"\",Report1!I$6)","v":""}]
[null,null,null,{"$f":"IF(E34=\"\",\"\",Customer!E$7)","v":""},null,"","",{"$f":"IF(E34=\"\",\"\",Report1!I$9)","v":""},null,{"$f":"CONCATENATE(IF(AND(E34<>\"\",OR(Report1!I$9=\"\",Report1!J$9=\"\")),VLOOKUP(300,TextID,CODE(Language!$B$4)-64,FALSE),\"\"),IF(AND(E34<>\"\",I34=\"\"),VLOOKUP(302,TextID,CODE(Language!$B$4)-64,FALSE),\"\"),IF(AND(E34=\"\",I34<>\"\"),VLOOKUP(306,TextID,CODE(Language!$B$4)-64,FALSE),\"\"),IF(AND(E34<>\"\",E34=E33),VLOOKUP(308,TextID,CODE(Language!$B$4)-64,FALSE),\"\"))","v":""},null,{"$f":"IF(E34=\"\",\"\",Report1!I$6)","v":""}]
[null,null,null,{"$f":"IF(E35=\"\",\"\",Customer!E$7)","v":""},null,"","",{"$f":"IF(E35=\"\",\"\",Report1!I$9)","v":""},null,{"$f":"CONCATENATE(IF(AND(E35<>\"\",OR(Report1!I$9=\"\",Report1!J$9=\"\")),VLOOKUP(300,TextID,CODE(Language!$B$4)-64,FALSE),\"\"),IF(AND(E35<>\"\",I35=\"\"),VLOOKUP(302,TextID,CODE(Language!$B$4)-64,FALSE),\"\"),IF(AND(E35=\"\",I35<>\"\"),VLOOKUP(306,TextID,CODE(Language!$B$4)-64,FALSE),\"\"),IF(AND(E35<>\"\",E35=E34),VLOOKUP(308,TextID,CODE(Language!$B$4)-64,FALSE),\"\"))","v":""},null,{"$f":"IF(E35=\"\",\"\",Report1!I$6)","v":""}]
[null,null,null,{"$f":"IF(E36=\"\",\"\",Customer!E$7)","v":""},null,"","",{"$f":"IF(E36=\"\",\"\",Report1!I$9)","v":""},null,{"$f":"CONCATENATE(IF(AND(E36<>\"\",OR(Report1!I$9=\"\",Report1!J$9=\"\")),VLOOKUP(300,TextID,CODE(Language!$B$4)-64,FALSE),\"\"),IF(AND(E36<>\"\",I36=\"\"),VLOOKUP(302,TextID,CODE(Language!$B$4)-64,FALSE),\"\"),IF(AND(E36=\"\",I36<>\"\"),VLOOKUP(306,TextID,CODE(Language!$B$4)-64,FALSE),\"\"),IF(AND(E36<>\"\",E36=E35),VLOOKUP(308,TextID,CODE(Language!$B$4)-64,FALSE),\"\"))","v":""},null,{"$f":"IF(E36=\"\",\"\",Report1!I$6)","v":""}]
[null,null,null,{"$f":"IF(E37=\"\",\"\",Customer!E$7)","v":""},null,"","",{"$f":"IF(E37=\"\",\"\",Report1!I$9)","v":""},null,{"$f":"CONCATENATE(IF(AND(E37<>\"\",OR(Report1!I$9=\"\",Report1!J$9=\"\")),VLOOKUP(300,TextID,CODE(Language!$B$4)-64,FALSE),\"\"),IF(AND(E37<>\"\",I37=\"\"),VLOOKUP(302,TextID,CODE(Language!$B$4)-64,FALSE),\"\"),IF(AND(E37=\"\",I37<>\"\"),VLOOKUP(306,TextID,CODE(Language!$B$4)-64,FALSE),\"\"),IF(AND(E37<>\"\",E37=E36),VLOOKUP(308,TextID,CODE(Language!$B$4)-64,FALSE),\"\"))","v":""},null,{"$f":"IF(E37=\"\",\"\",Report1!I$6)","v":""}]
[null,null,null,{"$f":"IF(E38=\"\",\"\",Customer!E$7)","v":""},null,"","",{"$f":"IF(E38=\"\",\"\",Report1!I$9)","v":""},null,{"$f":"CONCATENATE(IF(AND(E38<>\"\",OR(Report1!I$9=\"\",Report1!J$9=\"\")),VLOOKUP(300,TextID,CODE(Language!$B$4)-64,FALSE),\"\"),IF(AND(E38<>\"\",I38=\"\"),VLOOKUP(302,TextID,CODE(Language!$B$4)-64,FALSE),\"\"),IF(AND(E38=\"\",I38<>\"\"),VLOOKUP(306,TextID,CODE(Language!$B$4)-64,FALSE),\"\"),IF(AND(E38<>\"\",E38=E37),VLOOKUP(308,TextID,CODE(Language!$B$4)-64,FALSE),\"\"))","v":""},null,{"$f":"IF(E38=\"\",\"\",Report1!I$6)","v":""}]
[null,null,null,{"$f":"IF(E39=\"\",\"\",Customer!E$7)","v":""},null,"","",{"$f":"IF(E39=\"\",\"\",Report1!I$9)","v":""},null,{"$f":"CONCATENATE(IF(AND(E39<>\"\",OR(Report1!I$9=\"\",Report1!J$9=\"\")),VLOOKUP(300,TextID,CODE(Language!$B$4)-64,FALSE),\"\"),IF(AND(E39<>\"\",I39=\"\"),VLOOKUP(302,TextID,CODE(Language!$B$4)-64,FALSE),\"\"),IF(AND(E39=\"\",I39<>\"\"),VLOOKUP(306,TextID,CODE(Language!$B$4)-64,FALSE),\"\"),IF(AND(E39<>\"\",E39=E38),VLOOKUP(308,TextID,CODE(Language!$B$4)-64,FALSE),\"\"))","v":""},null,{"$f":"IF(E39=\"\",\"\",Report1!I$6)","v":""}]
[null,null,null,{"$f":"IF(E40=\"\",\"\",Customer!E$7)","v":""},null,"","",{"$f":"IF(E40=\"\",\"\",Report1!I$9)","v":""},null,{"$f":"CONCATENATE(IF(AND(E40<>\"\",OR(Report1!I$9=\"\",Report1!J$9=\"\")),VLOOKUP(300,TextID,CODE(Language!$B$4)-64,FALSE),\"\"),IF(AND(E40<>\"\",I40=\"\"),VLOOKUP(302,TextID,CODE(Language!$B$4)-64,FALSE),\"\"),IF(AND(E40=\"\",I40<>\"\"),VLOOKUP(306,TextID,CODE(Language!$B$4)-64,FALSE),\"\"),IF(AND(E40<>\"\",E40=E39),VLOOKUP(308,TextID,CODE(Language!$B$4)-64,FALSE),\"\"))","v":""},null,{"$f":"IF(E40=\"\",\"\",Report1!I$6)","v":""}]
[null,null,null,{"$f":"IF(E41=\"\",\"\",Customer!E$7)","v":""},null,"","",{"$f":"IF(E41=\"\",\"\",Report1!I$9)","v":""},null,{"$f":"CONCATENATE(IF(AND(E41<>\"\",OR(Report1!I$9=\"\",Report1!J$9=\"\")),VLOOKUP(300,TextID,CODE(Language!$B$4)-64,FALSE),\"\"),IF(AND(E41<>\"\",I41=\"\"),VLOOKUP(302,TextID,CODE(Language!$B$4)-64,FALSE),\"\"),IF(AND(E41=\"\",I41<>\"\"),VLOOKUP(306,TextID,CODE(Language!$B$4)-64,FALSE),\"\"),IF(AND(E41<>\"\",E41=E40),VLOOKUP(308,TextID,CODE(Language!$B$4)-64,FALSE),\"\"))","v":""},null,{"$f":"IF(E41=\"\",\"\",Report1!I$6)","v":""}]
[null,null,null,{"$f":"IF(E42=\"\",\"\",Customer!E$7)","v":""},null,"","",{"$f":"IF(E42=\"\",\"\",Report1!I$9)","v":""},null,{"$f":"CONCATENATE(IF(AND(E42<>\"\",OR(Report1!I$9=\"\",Report1!J$9=\"\")),VLOOKUP(300,TextID,CODE(Language!$B$4)-64,FALSE),\"\"),IF(AND(E42<>\"\",I42=\"\"),VLOOKUP(302,TextID,CODE(Language!$B$4)-64,FALSE),\"\"),IF(AND(E42=\"\",I42<>\"\"),VLOOKUP(306,TextID,CODE(Language!$B$4)-64,FALSE),\"\"),IF(AND(E42<>\"\",E42=E41),VLOOKUP(308,TextID,CODE(Language!$B$4)-64,FALSE),\"\"))","v":""},null,{"$f":"IF(E42=\"\",\"\",Report1!I$6)","v":""}]
[null,null,null,{"$f":"IF(E43=\"\",\"\",Customer!E$7)","v":""},null,"","",{"$f":"IF(E43=\"\",\"\",Report1!I$9)","v":""},null,{"$f":"CONCATENATE(IF(AND(E43<>\"\",OR(Report1!I$9=\"\",Report1!J$9=\"\")),VLOOKUP(300,TextID,CODE(Language!$B$4)-64,FALSE),\"\"),IF(AND(E43<>\"\",I43=\"\"),VLOOKUP(302,TextID,CODE(Language!$B$4)-64,FALSE),\"\"),IF(AND(E43=\"\",I43<>\"\"),VLOOKUP(306,TextID,CODE(Language!$B$4)-64,FALSE),\"\"),IF(AND(E43<>\"\",E43=E42),VLOOKUP(308,TextID,CODE(Language!$B$4)-64,FALSE),\"\"))","v":""},null,{"$f":"IF(E43=\"\",\"\",Report1!I$6)","v":""}]
[null,null,null,{"$f":"IF(E44=\"\",\"\",Customer!E$7)","v":""},null,"","",{"$f":"IF(E44=\"\",\"\",Report1!I$9)","v":""},null,{"$f":"CONCATENATE(IF(AND(E44<>\"\",OR(Report1!I$9=\"\",Report1!J$9=\"\")),VLOOKUP(300,TextID,CODE(Language!$B$4)-64,FALSE),\"\"),IF(AND(E44<>\"\",I44=\"\"),VLOOKUP(302,TextID,CODE(Language!$B$4)-64,FALSE),\"\"),IF(AND(E44=\"\",I44<>\"\"),VLOOKUP(306,TextID,CODE(Language!$B$4)-64,FALSE),\"\"),IF(AND(E44<>\"\",E44=E43),VLOOKUP(308,TextID,CODE(Language!$B$4)-64,FALSE),\"\"))","v":""},null,{"$f":"IF(E44=\"\",\"\",Report1!I$6)","v":""}]
[null,null,null,{"$f":"IF(E45=\"\",\"\",Customer!E$7)","v":""},null,{"$f":"IF($E45=\"\",\"\",VLOOKUP($E45,Material2b,2))","v":""},{"$f":"IF($E45=\"\",\"\",VLOOKUP($E45,Material2b,3))","v":""},{"$f":"IF(E45=\"\",\"\",Report1!I$9)","v":""},null,{"$f":"CONCATENATE(IF(AND(E45<>\"\",OR(Report1!I$9=\"\",Report1!J$9=\"\")),VLOOKUP(300,TextID,CODE(Language!$B$4)-64,FALSE),\"\"),IF(AND(E45<>\"\",I45=\"\"),VLOOKUP(302,TextID,CODE(Language!$B$4)-64,FALSE),\"\"),IF(AND(E45=\"\",I45<>\"\"),VLOOKUP(306,TextID,CODE(Language!$B$4)-64,FALSE),\"\"),IF(AND(E45<>\"\",E45=E44),VLOOKUP(308,TextID,CODE(Language!$B$4)-64,FALSE),\"\"))","v":""},null,{"$f":"IF(E45=\"\",\"\",Report1!I$6)","v":""}]
[null,null,null,{"$f":"IF(E46=\"\",\"\",Customer!E$7)","v":""},null,"","",{"$f":"IF(E46=\"\",\"\",Report1!I$9)","v":""},null,{"$f":"CONCATENATE(IF(AND(E46<>\"\",OR(Report1!I$9=\"\",Report1!J$9=\"\")),VLOOKUP(300,TextID,CODE(Language!$B$4)-64,FALSE),\"\"),IF(AND(E46<>\"\",I46=\"\"),VLOOKUP(302,TextID,CODE(Language!$B$4)-64,FALSE),\"\"),IF(AND(E46=\"\",I46<>\"\"),VLOOKUP(306,TextID,CODE(Language!$B$4)-64,FALSE),\"\"),IF(AND(E46<>\"\",E46=E45),VLOOKUP(308,TextID,CODE(Language!$B$4)-64,FALSE),\"\"))","v":""},null,{"$f":"IF(E46=\"\",\"\",Report1!I$6)","v":""}]
[null,null,null,{"$f":"IF(E47=\"\",\"\",Customer!E$7)","v":""},null,"","",{"$f":"IF(E47=\"\",\"\",Report1!I$9)","v":""},null,{"$f":"CONCATENATE(IF(AND(E47<>\"\",OR(Report1!I$9=\"\",Report1!J$9=\"\")),VLOOKUP(300,TextID,CODE(Language!$B$4)-64,FALSE),\"\"),IF(AND(E47<>\"\",I47=\"\"),VLOOKUP(302,TextID,CODE(Language!$B$4)-64,FALSE),\"\"),IF(AND(E47=\"\",I47<>\"\"),VLOOKUP(306,TextID,CODE(Language!$B$4)-64,FALSE),\"\"),IF(AND(E47<>\"\",E47=E46),VLOOKUP(308,TextID,CODE(Language!$B$4)-64,FALSE),\"\"))","v":""},null,{"$f":"IF(E47=\"\",\"\",Report1!I$6)","v":""}]
[null,null,null,{"$f":"IF(E48=\"\",\"\",Customer!E$7)","v":""},null,"","",{"$f":"IF(E48=\"\",\"\",Report1!I$9)","v":""},null,{"$f":"CONCATENATE(IF(AND(E48<>\"\",OR(Report1!I$9=\"\",Report1!J$9=\"\")),VLOOKUP(300,TextID,CODE(Language!$B$4)-64,FALSE),\"\"),IF(AND(E48<>\"\",I48=\"\"),VLOOKUP(302,TextID,CODE(Language!$B$4)-64,FALSE),\"\"),IF(AND(E48=\"\",I48<>\"\"),VLOOKUP(306,TextID,CODE(Language!$B$4)-64,FALSE),\"\"),IF(AND(E48<>\"\",E48=E47),VLOOKUP(308,TextID,CODE(Language!$B$4)-64,FALSE),\"\"))","v":""},null,{"$f":"IF(E48=\"\",\"\",Report1!I$6)","v":""}]
[null,null,null,{"$f":"IF(E49=\"\",\"\",Customer!E$7)","v":""},null,"","",{"$f":"IF(E49=\"\",\"\",Report1!I$9)","v":""},null,{"$f":"CONCATENATE(IF(AND(E49<>\"\",OR(Report1!I$9=\"\",Report1!J$9=\"\")),VLOOKUP(300,TextID,CODE(Language!$B$4)-64,FALSE),\"\"),IF(AND(E49<>\"\",I49=\"\"),VLOOKUP(302,TextID,CODE(Language!$B$4)-64,FALSE),\"\"),IF(AND(E49=\"\",I49<>\"\"),VLOOKUP(306,TextID,CODE(Language!$B$4)-64,FALSE),\"\"),IF(AND(E49<>\"\",E49=E48),VLOOKUP(308,TextID,CODE(Language!$B$4)-64,FALSE),\"\"))","v":""},null,{"$f":"IF(E49=\"\",\"\",Report1!I$6)","v":""}]
[null,null,null,{"$f":"IF(E50=\"\",\"\",Customer!E$7)","v":""},null,"","",{"$f":"IF(E50=\"\",\"\",Report1!I$9)","v":""},null,{"$f":"CONCATENATE(IF(AND(E50<>\"\",OR(Report1!I$9=\"\",Report1!J$9=\"\")),VLOOKUP(300,TextID,CODE(Language!$B$4)-64,FALSE),\"\"),IF(AND(E50<>\"\",I50=\"\"),VLOOKUP(302,TextID,CODE(Language!$B$4)-64,FALSE),\"\"),IF(AND(E50=\"\",I50<>\"\"),VLOOKUP(306,TextID,CODE(Language!$B$4)-64,FALSE),\"\"),IF(AND(E50<>\"\",E50=E49),VLOOKUP(308,TextID,CODE(Language!$B$4)-64,FALSE),\"\"))","v":""},null,{"$f":"IF(E50=\"\",\"\",Report1!I$6)","v":""}]
[null,null,null,{"$f":"IF(E51=\"\",\"\",Customer!E$7)","v":""},null,"","",{"$f":"IF(E51=\"\",\"\",Report1!I$9)","v":""},null,{"$f":"CONCATENATE(IF(AND(E51<>\"\",OR(Report1!I$9=\"\",Report1!J$9=\"\")),VLOOKUP(300,TextID,CODE(Language!$B$4)-64,FALSE),\"\"),IF(AND(E51<>\"\",I51=\"\"),VLOOKUP(302,TextID,CODE(Language!$B$4)-64,FALSE),\"\"),IF(AND(E51=\"\",I51<>\"\"),VLOOKUP(306,TextID,CODE(Language!$B$4)-64,FALSE),\"\"),IF(AND(E51<>\"\",E51=E50),VLOOKUP(308,TextID,CODE(Language!$B$4)-64,FALSE),\"\"))","v":""},null,{"$f":"IF(E51=\"\",\"\",Report1!I$6)","v":""}]
[null,null,null,{"$f":"IF(E52=\"\",\"\",Customer!E$7)","v":""},null,"","",{"$f":"IF(E52=\"\",\"\",Report1!I$9)","v":""},null,{"$f":"CONCATENATE(IF(AND(E52<>\"\",OR(Report1!I$9=\"\",Report1!J$9=\"\")),VLOOKUP(300,TextID,CODE(Language!$B$4)-64,FALSE),\"\"),IF(AND(E52<>\"\",I52=\"\"),VLOOKUP(302,TextID,CODE(Language!$B$4)-64,FALSE),\"\"),IF(AND(E52=\"\",I52<>\"\"),VLOOKUP(306,TextID,CODE(Language!$B$4)-64,FALSE),\"\"),IF(AND(E52<>\"\",E52=E51),VLOOKUP(308,TextID,CODE(Language!$B$4)-64,FALSE),\"\"))","v":""},null,{"$f":"IF(E52=\"\",\"\",Report1!I$6)","v":""}]
[null,null,null,{"$f":"IF(E53=\"\",\"\",Customer!E$7)","v":""},null,"","",{"$f":"IF(E53=\"\",\"\",Report1!I$9)","v":""},null,{"$f":"CONCATENATE(IF(AND(E53<>\"\",OR(Report1!I$9=\"\",Report1!J$9=\"\")),VLOOKUP(300,TextID,CODE(Language!$B$4)-64,FALSE),\"\"),IF(AND(E53<>\"\",I53=\"\"),VLOOKUP(302,TextID,CODE(Language!$B$4)-64,FALSE),\"\"),IF(AND(E53=\"\",I53<>\"\"),VLOOKUP(306,TextID,CODE(Language!$B$4)-64,FALSE),\"\"),IF(AND(E53<>\"\",E53=E52),VLOOKUP(308,TextID,CODE(Language!$B$4)-64,FALSE),\"\"))","v":""},null,{"$f":"IF(E53=\"\",\"\",Report1!I$6)","v":""}]
[null,null,null,{"$f":"IF(E54=\"\",\"\",Customer!E$7)","v":""},null,"","",{"$f":"IF(E54=\"\",\"\",Report1!I$9)","v":""},null,{"$f":"CONCATENATE(IF(AND(E54<>\"\",OR(Report1!I$9=\"\",Report1!J$9=\"\")),VLOOKUP(300,TextID,CODE(Language!$B$4)-64,FALSE),\"\"),IF(AND(E54<>\"\",I54=\"\"),VLOOKUP(302,TextID,CODE(Language!$B$4)-64,FALSE),\"\"),IF(AND(E54=\"\",I54<>\"\"),VLOOKUP(306,TextID,CODE(Language!$B$4)-64,FALSE),\"\"),IF(AND(E54<>\"\",E54=E53),VLOOKUP(308,TextID,CODE(Language!$B$4)-64,FALSE),\"\"))","v":""},null,{"$f":"IF(E54=\"\",\"\",Report1!I$6)","v":""}]
[null,null,null,{"$f":"IF(E55=\"\",\"\",Customer!E$7)","v":""},null,"","",{"$f":"IF(E55=\"\",\"\",Report1!I$9)","v":""},null,{"$f":"CONCATENATE(IF(AND(E55<>\"\",OR(Report1!I$9=\"\",Report1!J$9=\"\")),VLOOKUP(300,TextID,CODE(Language!$B$4)-64,FALSE),\"\"),IF(AND(E55<>\"\",I55=\"\"),VLOOKUP(302,TextID,CODE(Language!$B$4)-64,FALSE),\"\"),IF(AND(E55=\"\",I55<>\"\"),VLOOKUP(306,TextID,CODE(Language!$B$4)-64,FALSE),\"\"),IF(AND(E55<>\"\",E55=E54),VLOOKUP(308,TextID,CODE(Language!$B$4)-64,FALSE),\"\"))","v":""},null,{"$f":"IF(E55=\"\",\"\",Report1!I$6)","v":""}]
[null,null,null,{"$f":"IF(E56=\"\",\"\",Customer!E$7)","v":""},null,"","",{"$f":"IF(E56=\"\",\"\",Report1!I$9)","v":""},null,{"$f":"CONCATENATE(IF(AND(E56<>\"\",OR(Report1!I$9=\"\",Report1!J$9=\"\")),VLOOKUP(300,TextID,CODE(Language!$B$4)-64,FALSE),\"\"),IF(AND(E56<>\"\",I56=\"\"),VLOOKUP(302,TextID,CODE(Language!$B$4)-64,FALSE),\"\"),IF(AND(E56=\"\",I56<>\"\"),VLOOKUP(306,TextID,CODE(Language!$B$4)-64,FALSE),\"\"),IF(AND(E56<>\"\",E56=E55),VLOOKUP(308,TextID,CODE(Language!$B$4)-64,FALSE),\"\"))","v":""},null,{"$f":"IF(E56=\"\",\"\",Report1!I$6)","v":""}]
[null,null,null,{"$f":"IF(E57=\"\",\"\",Customer!E$7)","v":""},null,"","",{"$f":"IF(E57=\"\",\"\",Report1!I$9)","v":""},null,{"$f":"CONCATENATE(IF(AND(E57<>\"\",OR(Report1!I$9=\"\",Report1!J$9=\"\")),VLOOKUP(300,TextID,CODE(Language!$B$4)-64,FALSE),\"\"),IF(AND(E57<>\"\",I57=\"\"),VLOOKUP(302,TextID,CODE(Language!$B$4)-64,FALSE),\"\"),IF(AND(E57=\"\",I57<>\"\"),VLOOKUP(306,TextID,CODE(Language!$B$4)-64,FALSE),\"\"),IF(AND(E57<>\"\",E57=E56),VLOOKUP(308,TextID,CODE(Language!$B$4)-64,FALSE),\"\"))","v":""},null,{"$f":"IF(E57=\"\",\"\",Report1!I$6)","v":""}]
[null,null,null,{"$f":"IF(E58=\"\",\"\",Customer!E$7)","v":""},null,"","",{"$f":"IF(E58=\"\",\"\",Report1!I$9)","v":""},null,{"$f":"CONCATENATE(IF(AND(E58<>\"\",OR(Report1!I$9=\"\",Report1!J$9=\"\")),VLOOKUP(300,TextID,CODE(Language!$B$4)-64,FALSE),\"\"),IF(AND(E58<>\"\",I58=\"\"),VLOOKUP(302,TextID,CODE(Language!$B$4)-64,FALSE),\"\"),IF(AND(E58=\"\",I58<>\"\"),VLOOKUP(306,TextID,CODE(Language!$B$4)-64,FALSE),\"\"),IF(AND(E58<>\"\",E58=E57),VLOOKUP(308,TextID,CODE(Language!$B$4)-64,FALSE),\"\"))","v":""},null,{"$f":"IF(E58=\"\",\"\",Report1!I$6)","v":""}]
[null,null,null,{"$f":"IF(E59=\"\",\"\",Customer!E$7)","v":""},null,"","",{"$f":"IF(E59=\"\",\"\",Report1!I$9)","v":""},null,{"$f":"CONCATENATE(IF(AND(E59<>\"\",OR(Report1!I$9=\"\",Report1!J$9=\"\")),VLOOKUP(300,TextID,CODE(Language!$B$4)-64,FALSE),\"\"),IF(AND(E59<>\"\",I59=\"\"),VLOOKUP(302,TextID,CODE(Language!$B$4)-64,FALSE),\"\"),IF(AND(E59=\"\",I59<>\"\"),VLOOKUP(306,TextID,CODE(Language!$B$4)-64,FALSE),\"\"),IF(AND(E59<>\"\",E59=E58),VLOOKUP(308,TextID,CODE(Language!$B$4)-64,FALSE),\"\"))","v":""},null,{"$f":"IF(E59=\"\",\"\",Report1!I$6)","v":""}]
[null,null,null,{"$f":"IF(E60=\"\",\"\",Customer!E$7)","v":""},null,"","",{"$f":"IF(E60=\"\",\"\",Report1!I$9)","v":""},null,{"$f":"CONCATENATE(IF(AND(E60<>\"\",OR(Report1!I$9=\"\",Report1!J$9=\"\")),VLOOKUP(300,TextID,CODE(Language!$B$4)-64,FALSE),\"\"),IF(AND(E60<>\"\",I60=\"\"),VLOOKUP(302,TextID,CODE(Language!$B$4)-64,FALSE),\"\"),IF(AND(E60=\"\",I60<>\"\"),VLOOKUP(306,TextID,CODE(Language!$B$4)-64,FALSE),\"\"),IF(AND(E60<>\"\",E60=E59),VLOOKUP(308,TextID,CODE(Language!$B$4)-64,FALSE),\"\"))","v":""},null,{"$f":"IF(E60=\"\",\"\",Report1!I$6)","v":""}]
[null,null,null,{"$f":"IF(E61=\"\",\"\",Customer!E$7)","v":""},null,"","",{"$f":"IF(E61=\"\",\"\",Report1!I$9)","v":""},null,{"$f":"CONCATENATE(IF(AND(E61<>\"\",OR(Report1!I$9=\"\",Report1!J$9=\"\")),VLOOKUP(300,TextID,CODE(Language!$B$4)-64,FALSE),\"\"),IF(AND(E61<>\"\",I61=\"\"),VLOOKUP(302,TextID,CODE(Language!$B$4)-64,FALSE),\"\"),IF(AND(E61=\"\",I61<>\"\"),VLOOKUP(306,TextID,CODE(Language!$B$4)-64,FALSE),\"\"),IF(AND(E61<>\"\",E61=E60),VLOOKUP(308,TextID,CODE(Language!$B$4)-64,FALSE),\"\"))","v":""},null,{"$f":"IF(E61=\"\",\"\",Report1!I$6)","v":""}]
[null,null,null,{"$f":"IF(E62=\"\",\"\",Customer!E$7)","v":""},null,"","",{"$f":"IF(E62=\"\",\"\",Report1!I$9)","v":""},null,{"$f":"CONCATENATE(IF(AND(E62<>\"\",OR(Report1!I$9=\"\",Report1!J$9=\"\")),VLOOKUP(300,TextID,CODE(Language!$B$4)-64,FALSE),\"\"),IF(AND(E62<>\"\",I62=\"\"),VLOOKUP(302,TextID,CODE(Language!$B$4)-64,FALSE),\"\"),IF(AND(E62=\"\",I62<>\"\"),VLOOKUP(306,TextID,CODE(Language!$B$4)-64,FALSE),\"\"),IF(AND(E62<>\"\",E62=E61),VLOOKUP(308,TextID,CODE(Language!$B$4)-64,FALSE),\"\"))","v":""},null,{"$f":"IF(E62=\"\",\"\",Report1!I$6)","v":""}]
[null,null,null,{"$f":"IF(E63=\"\",\"\",Customer!E$7)","v":""},null,"","",{"$f":"IF(E63=\"\",\"\",Report1!I$9)","v":""},null,{"$f":"CONCATENATE(IF(AND(E63<>\"\",OR(Report1!I$9=\"\",Report1!J$9=\"\")),VLOOKUP(300,TextID,CODE(Language!$B$4)-64,FALSE),\"\"),IF(AND(E63<>\"\",I63=\"\"),VLOOKUP(302,TextID,CODE(Language!$B$4)-64,FALSE),\"\"),IF(AND(E63=\"\",I63<>\"\"),VLOOKUP(306,TextID,CODE(Language!$B$4)-64,FALSE),\"\"),IF(AND(E63<>\"\",E63=E62),VLOOKUP(308,TextID,CODE(Language!$B$4)-64,FALSE),\"\"))","v":""},null,{"$f":"IF(E63=\"\",\"\",Report1!I$6)","v":""}]
[null,null,null,{"$f":"IF(E64=\"\",\"\",Customer!E$7)","v":""},null,"","",{"$f":"IF(E64=\"\",\"\",Report1!I$9)","v":""},null,{"$f":"CONCATENATE(IF(AND(E64<>\"\",OR(Report1!I$9=\"\",Report1!J$9=\"\")),VLOOKUP(300,TextID,CODE(Language!$B$4)-64,FALSE),\"\"),IF(AND(E64<>\"\",I64=\"\"),VLOOKUP(302,TextID,CODE(Language!$B$4)-64,FALSE),\"\"),IF(AND(E64=\"\",I64<>\"\"),VLOOKUP(306,TextID,CODE(Language!$B$4)-64,FALSE),\"\"),IF(AND(E64<>\"\",E64=E63),VLOOKUP(308,TextID,CODE(Language!$B$4)-64,FALSE),\"\"))","v":""},null,{"$f":"IF(E64=\"\",\"\",Report1!I$6)","v":""}]
[null,null,null,{"$f":"IF(E65=\"\",\"\",Customer!E$7)","v":""},null,"","",{"$f":"IF(E65=\"\",\"\",Report1!I$9)","v":""},null,{"$f":"CONCATENATE(IF(AND(E65<>\"\",OR(Report1!I$9=\"\",Report1!J$9=\"\")),VLOOKUP(300,TextID,CODE(Language!$B$4)-64,FALSE),\"\"),IF(AND(E65<>\"\",I65=\"\"),VLOOKUP(302,TextID,CODE(Language!$B$4)-64,FALSE),\"\"),IF(AND(E65=\"\",I65<>\"\"),VLOOKUP(306,TextID,CODE(Language!$B$4)-64,FALSE),\"\"),IF(AND(E65<>\"\",E65=E64),VLOOKUP(308,TextID,CODE(Language!$B$4)-64,FALSE),\"\"))","v":""},null,{"$f":"IF(E65=\"\",\"\",Report1!I$6)","v":""}]
[null,null,null,{"$f":"IF(E66=\"\",\"\",Customer!E$7)","v":""},null,"","",{"$f":"IF(E66=\"\",\"\",Report1!I$9)","v":""},null,{"$f":"CONCATENATE(IF(AND(E66<>\"\",OR(Report1!I$9=\"\",Report1!J$9=\"\")),VLOOKUP(300,TextID,CODE(Language!$B$4)-64,FALSE),\"\"),IF(AND(E66<>\"\",I66=\"\"),VLOOKUP(302,TextID,CODE(Language!$B$4)-64,FALSE),\"\"),IF(AND(E66=\"\",I66<>\"\"),VLOOKUP(306,TextID,CODE(Language!$B$4)-64,FALSE),\"\"),IF(AND(E66<>\"\",E66=E65),VLOOKUP(308,TextID,CODE(Language!$B$4)-64,FALSE),\"\"))","v":""},null,{"$f":"IF(E66=\"\",\"\",Report1!I$6)","v":""}]
[null,null,null,{"$f":"IF(E67=\"\",\"\",Customer!E$7)","v":""},null,"","",{"$f":"IF(E67=\"\",\"\",Report1!I$9)","v":""},null,{"$f":"CONCATENATE(IF(AND(E67<>\"\",OR(Report1!I$9=\"\",Report1!J$9=\"\")),VLOOKUP(300,TextID,CODE(Language!$B$4)-64,FALSE),\"\"),IF(AND(E67<>\"\",I67=\"\"),VLOOKUP(302,TextID,CODE(Language!$B$4)-64,FALSE),\"\"),IF(AND(E67=\"\",I67<>\"\"),VLOOKUP(306,TextID,CODE(Language!$B$4)-64,FALSE),\"\"),IF(AND(E67<>\"\",E67=E66),VLOOKUP(308,TextID,CODE(Language!$B$4)-64,FALSE),\"\"))","v":""},null,{"$f":"IF(E67=\"\",\"\",Report1!I$6)","v":""}]
[null,null,null,{"$f":"IF(E68=\"\",\"\",Customer!E$7)","v":""},null,"","",{"$f":"IF(E68=\"\",\"\",Report1!I$9)","v":""},null,{"$f":"CONCATENATE(IF(AND(E68<>\"\",OR(Report1!I$9=\"\",Report1!J$9=\"\")),VLOOKUP(300,TextID,CODE(Language!$B$4)-64,FALSE),\"\"),IF(AND(E68<>\"\",I68=\"\"),VLOOKUP(302,TextID,CODE(Language!$B$4)-64,FALSE),\"\"),IF(AND(E68=\"\",I68<>\"\"),VLOOKUP(306,TextID,CODE(Language!$B$4)-64,FALSE),\"\"),IF(AND(E68<>\"\",E68=E67),VLOOKUP(308,TextID,CODE(Language!$B$4)-64,FALSE),\"\"))","v":""},null,{"$f":"IF(E68=\"\",\"\",Report1!I$6)","v":""}]
[null,null,null,{"$f":"IF(E69=\"\",\"\",Customer!E$7)","v":""},null,"","",{"$f":"IF(E69=\"\",\"\",Report1!I$9)","v":""},null,{"$f":"CONCATENATE(IF(AND(E69<>\"\",OR(Report1!I$9=\"\",Report1!J$9=\"\")),VLOOKUP(300,TextID,CODE(Language!$B$4)-64,FALSE),\"\"),IF(AND(E69<>\"\",I69=\"\"),VLOOKUP(302,TextID,CODE(Language!$B$4)-64,FALSE),\"\"),IF(AND(E69=\"\",I69<>\"\"),VLOOKUP(306,TextID,CODE(Language!$B$4)-64,FALSE),\"\"),IF(AND(E69<>\"\",E69=E68),VLOOKUP(308,TextID,CODE(Language!$B$4)-64,FALSE),\"\"))","v":""},null,{"$f":"IF(E69=\"\",\"\",Report1!I$6)","v":""}]
[null,null,null,{"$f":"IF(E70=\"\",\"\",Customer!E$7)","v":""},null,"","",{"$f":"IF(E70=\"\",\"\",Report1!I$9)","v":""},null,{"$f":"CONCATENATE(IF(AND(E70<>\"\",OR(Report1!I$9=\"\",Report1!J$9=\"\")),VLOOKUP(300,TextID,CODE(Language!$B$4)-64,FALSE),\"\"),IF(AND(E70<>\"\",I70=\"\"),VLOOKUP(302,TextID,CODE(Language!$B$4)-64,FALSE),\"\"),IF(AND(E70=\"\",I70<>\"\"),VLOOKUP(306,TextID,CODE(Language!$B$4)-64,FALSE),\"\"),IF(AND(E70<>\"\",E70=E69),VLOOKUP(308,TextID,CODE(Language!$B$4)-64,FALSE),\"\"))","v":""},null,{"$f":"IF(E70=\"\",\"\",Report1!I$6)","v":""}]
[null,null,null,{"$f":"IF(E71=\"\",\"\",Customer!E$7)","v":""},null,"","",{"$f":"IF(E71=\"\",\"\",Report1!I$9)","v":""},null,{"$f":"CONCATENATE(IF(AND(E71<>\"\",OR(Report1!I$9=\"\",Report1!J$9=\"\")),VLOOKUP(300,TextID,CODE(Language!$B$4)-64,FALSE),\"\"),IF(AND(E71<>\"\",I71=\"\"),VLOOKUP(302,TextID,CODE(Language!$B$4)-64,FALSE),\"\"),IF(AND(E71=\"\",I71<>\"\"),VLOOKUP(306,TextID,CODE(Language!$B$4)-64,FALSE),\"\"),IF(AND(E71<>\"\",E71=E70),VLOOKUP(308,TextID,CODE(Language!$B$4)-64,FALSE),\"\"))","v":""},null,{"$f":"IF(E71=\"\",\"\",Report1!I$6)","v":""}]
[null,null,null,{"$f":"IF(E72=\"\",\"\",Customer!E$7)","v":""},null,"","",{"$f":"IF(E72=\"\",\"\",Report1!I$9)","v":""},null,{"$f":"CONCATENATE(IF(AND(E72<>\"\",OR(Report1!I$9=\"\",Report1!J$9=\"\")),VLOOKUP(300,TextID,CODE(Language!$B$4)-64,FALSE),\"\"),IF(AND(E72<>\"\",I72=\"\"),VLOOKUP(302,TextID,CODE(Language!$B$4)-64,FALSE),\"\"),IF(AND(E72=\"\",I72<>\"\"),VLOOKUP(306,TextID,CODE(Language!$B$4)-64,FALSE),\"\"),IF(AND(E72<>\"\",E72=E71),VLOOKUP(308,TextID,CODE(Language!$B$4)-64,FALSE),\"\"))","v":""},null,{"$f":"IF(E72=\"\",\"\",Report1!I$6)","v":""}]
[null,null,null,{"$f":"IF(E73=\"\",\"\",Customer!E$7)","v":""},null,"","",{"$f":"IF(E73=\"\",\"\",Report1!I$9)","v":""},null,{"$f":"CONCATENATE(IF(AND(E73<>\"\",OR(Report1!I$9=\"\",Report1!J$9=\"\")),VLOOKUP(300,TextID,CODE(Language!$B$4)-64,FALSE),\"\"),IF(AND(E73<>\"\",I73=\"\"),VLOOKUP(302,TextID,CODE(Language!$B$4)-64,FALSE),\"\"),IF(AND(E73=\"\",I73<>\"\"),VLOOKUP(306,TextID,CODE(Language!$B$4)-64,FALSE),\"\"),IF(AND(E73<>\"\",E73=E72),VLOOKUP(308,TextID,CODE(Language!$B$4)-64,FALSE),\"\"))","v":""},null,{"$f":"IF(E73=\"\",\"\",Report1!I$6)","v":""}]
[null,null,null,{"$f":"IF(E74=\"\",\"\",Customer!E$7)","v":""},null,"","",{"$f":"IF(E74=\"\",\"\",Report1!I$9)","v":""},null,{"$f":"CONCATENATE(IF(AND(E74<>\"\",OR(Report1!I$9=\"\",Report1!J$9=\"\")),VLOOKUP(300,TextID,CODE(Language!$B$4)-64,FALSE),\"\"),IF(AND(E74<>\"\",I74=\"\"),VLOOKUP(302,TextID,CODE(Language!$B$4)-64,FALSE),\"\"),IF(AND(E74=\"\",I74<>\"\"),VLOOKUP(306,TextID,CODE(Language!$B$4)-64,FALSE),\"\"),IF(AND(E74<>\"\",E74=E73),VLOOKUP(308,TextID,CODE(Language!$B$4)-64,FALSE),\"\"))","v":""},null,{"$f":"IF(E74=\"\",\"\",Report1!I$6)","v":""}]
[null,null,null,{"$f":"IF(E75=\"\",\"\",Customer!E$7)","v":""},null,"","",{"$f":"IF(E75=\"\",\"\",Report1!I$9)","v":""},null,{"$f":"CONCATENATE(IF(AND(E75<>\"\",OR(Report1!I$9=\"\",Report1!J$9=\"\")),VLOOKUP(300,TextID,CODE(Language!$B$4)-64,FALSE),\"\"),IF(AND(E75<>\"\",I75=\"\"),VLOOKUP(302,TextID,CODE(Language!$B$4)-64,FALSE),\"\"),IF(AND(E75=\"\",I75<>\"\"),VLOOKUP(306,TextID,CODE(Language!$B$4)-64,FALSE),\"\"),IF(AND(E75<>\"\",E75=E74),VLOOKUP(308,TextID,CODE(Language!$B$4)-64,FALSE),\"\"))","v":""},null,{"$f":"IF(E75=\"\",\"\",Report1!I$6)","v":""}]
[null,null,null,{"$f":"IF(E76=\"\",\"\",Customer!E$7)","v":""},null,"","",{"$f":"IF(E76=\"\",\"\",Report1!I$9)","v":""},null,{"$f":"CONCATENATE(IF(AND(E76<>\"\",OR(Report1!I$9=\"\",Report1!J$9=\"\")),VLOOKUP(300,TextID,CODE(Language!$B$4)-64,FALSE),\"\"),IF(AND(E76<>\"\",I76=\"\"),VLOOKUP(302,TextID,CODE(Language!$B$4)-64,FALSE),\"\"),IF(AND(E76=\"\",I76<>\"\"),VLOOKUP(306,TextID,CODE(Language!$B$4)-64,FALSE),\"\"),IF(AND(E76<>\"\",E76=E75),VLOOKUP(308,TextID,CODE(Language!$B$4)-64,FALSE),\"\"))","v":""},null,{"$f":"IF(E76=\"\",\"\",Report1!I$6)","v":""}]
[null,null,null,{"$f":"IF(E77=\"\",\"\",Customer!E$7)","v":""},null,{"$f":"IF($E77=\"\",\"\",VLOOKUP($E77,Material2b,2))","v":""},{"$f":"IF($E77=\"\",\"\",VLOOKUP($E77,Material2b,3))","v":""},{"$f":"IF(E77=\"\",\"\",Report1!I$9)","v":""},null,{"$f":"CONCATENATE(IF(AND(E77<>\"\",OR(Report1!I$9=\"\",Report1!J$9=\"\")),VLOOKUP(300,TextID,CODE(Language!$B$4)-64,FALSE),\"\"),IF(AND(E77<>\"\",I77=\"\"),VLOOKUP(302,TextID,CODE(Language!$B$4)-64,FALSE),\"\"),IF(AND(E77=\"\",I77<>\"\"),VLOOKUP(306,TextID,CODE(Language!$B$4)-64,FALSE),\"\"),IF(AND(E77<>\"\",E77=E76),VLOOKUP(308,TextID,CODE(Language!$B$4)-64,FALSE),\"\"))","v":""},null,{"$f":"IF(E77=\"\",\"\",Report1!I$6)","v":""}]
[null,null,null,{"$f":"IF(E78=\"\",\"\",Customer!E$7)","v":""},null,"","",{"$f":"IF(E78=\"\",\"\",Report1!I$9)","v":""},null,{"$f":"CONCATENATE(IF(AND(E78<>\"\",OR(Report1!I$9=\"\",Report1!J$9=\"\")),VLOOKUP(300,TextID,CODE(Language!$B$4)-64,FALSE),\"\"),IF(AND(E78<>\"\",I78=\"\"),VLOOKUP(302,TextID,CODE(Language!$B$4)-64,FALSE),\"\"),IF(AND(E78=\"\",I78<>\"\"),VLOOKUP(306,TextID,CODE(Language!$B$4)-64,FALSE),\"\"),IF(AND(E78<>\"\",E78=E77),VLOOKUP(308,TextID,CODE(Language!$B$4)-64,FALSE),\"\"))","v":""},null,{"$f":"IF(E78=\"\",\"\",Report1!I$6)","v":""}]
[null,null,null,{"$f":"IF(E79=\"\",\"\",Customer!E$7)","v":""},null,"","",{"$f":"IF(E79=\"\",\"\",Report1!I$9)","v":""},null,{"$f":"CONCATENATE(IF(AND(E79<>\"\",OR(Report1!I$9=\"\",Report1!J$9=\"\")),VLOOKUP(300,TextID,CODE(Language!$B$4)-64,FALSE),\"\"),IF(AND(E79<>\"\",I79=\"\"),VLOOKUP(302,TextID,CODE(Language!$B$4)-64,FALSE),\"\"),IF(AND(E79=\"\",I79<>\"\"),VLOOKUP(306,TextID,CODE(Language!$B$4)-64,FALSE),\"\"),IF(AND(E79<>\"\",E79=E78),VLOOKUP(308,TextID,CODE(Language!$B$4)-64,FALSE),\"\"))","v":""},null,{"$f":"IF(E79=\"\",\"\",Report1!I$6)","v":""}]
[null,null,null,{"$f":"IF(E80=\"\",\"\",Customer!E$7)","v":""},null,"","",{"$f":"IF(E80=\"\",\"\",Report1!I$9)","v":""},null,{"$f":"CONCATENATE(IF(AND(E80<>\"\",OR(Report1!I$9=\"\",Report1!J$9=\"\")),VLOOKUP(300,TextID,CODE(Language!$B$4)-64,FALSE),\"\"),IF(AND(E80<>\"\",I80=\"\"),VLOOKUP(302,TextID,CODE(Language!$B$4)-64,FALSE),\"\"),IF(AND(E80=\"\",I80<>\"\"),VLOOKUP(306,TextID,CODE(Language!$B$4)-64,FALSE),\"\"),IF(AND(E80<>\"\",E80=E79),VLOOKUP(308,TextID,CODE(Language!$B$4)-64,FALSE),\"\"))","v":""},null,{"$f":"IF(E80=\"\",\"\",Report1!I$6)","v":""}]
[null,null,null,{"$f":"IF(E81=\"\",\"\",Customer!E$7)","v":""},null,"","",{"$f":"IF(E81=\"\",\"\",Report1!I$9)","v":""},null,{"$f":"CONCATENATE(IF(AND(E81<>\"\",OR(Report1!I$9=\"\",Report1!J$9=\"\")),VLOOKUP(300,TextID,CODE(Language!$B$4)-64,FALSE),\"\"),IF(AND(E81<>\"\",I81=\"\"),VLOOKUP(302,TextID,CODE(Language!$B$4)-64,FALSE),\"\"),IF(AND(E81=\"\",I81<>\"\"),VLOOKUP(306,TextID,CODE(Language!$B$4)-64,FALSE),\"\"),IF(AND(E81<>\"\",E81=E80),VLOOKUP(308,TextID,CODE(Language!$B$4)-64,FALSE),\"\"))","v":""},null,{"$f":"IF(E81=\"\",\"\",Report1!I$6)","v":""}]
[null,null,null,{"$f":"IF(E82=\"\",\"\",Customer!E$7)","v":""},null,"","",{"$f":"IF(E82=\"\",\"\",Report1!I$9)","v":""},null,{"$f":"CONCATENATE(IF(AND(E82<>\"\",OR(Report1!I$9=\"\",Report1!J$9=\"\")),VLOOKUP(300,TextID,CODE(Language!$B$4)-64,FALSE),\"\"),IF(AND(E82<>\"\",I82=\"\"),VLOOKUP(302,TextID,CODE(Language!$B$4)-64,FALSE),\"\"),IF(AND(E82=\"\",I82<>\"\"),VLOOKUP(306,TextID,CODE(Language!$B$4)-64,FALSE),\"\"),IF(AND(E82<>\"\",E82=E81),VLOOKUP(308,TextID,CODE(Language!$B$4)-64,FALSE),\"\"))","v":""},null,{"$f":"IF(E82=\"\",\"\",Report1!I$6)","v":""}]
[null,null,null,{"$f":"IF(E83=\"\",\"\",Customer!E$7)","v":""},null,"","",{"$f":"IF(E83=\"\",\"\",Report1!I$9)","v":""},null,{"$f":"CONCATENATE(IF(AND(E83<>\"\",OR(Report1!I$9=\"\",Report1!J$9=\"\")),VLOOKUP(300,TextID,CODE(Language!$B$4)-64,FALSE),\"\"),IF(AND(E83<>\"\",I83=\"\"),VLOOKUP(302,TextID,CODE(Language!$B$4)-64,FALSE),\"\"),IF(AND(E83=\"\",I83<>\"\"),VLOOKUP(306,TextID,CODE(Language!$B$4)-64,FALSE),\"\"),IF(AND(E83<>\"\",E83=E82),VLOOKUP(308,TextID,CODE(Language!$B$4)-64,FALSE),\"\"))","v":""},null,{"$f":"IF(E83=\"\",\"\",Report1!I$6)","v":""}]
[null,null,null,{"$f":"IF(E84=\"\",\"\",Customer!E$7)","v":""},null,"","",{"$f":"IF(E84=\"\",\"\",Report1!I$9)","v":""},null,{"$f":"CONCATENATE(IF(AND(E84<>\"\",OR(Report1!I$9=\"\",Report1!J$9=\"\")),VLOOKUP(300,TextID,CODE(Language!$B$4)-64,FALSE),\"\"),IF(AND(E84<>\"\",I84=\"\"),VLOOKUP(302,TextID,CODE(Language!$B$4)-64,FALSE),\"\"),IF(AND(E84=\"\",I84<>\"\"),VLOOKUP(306,TextID,CODE(Language!$B$4)-64,FALSE),\"\"),IF(AND(E84<>\"\",E84=E83),VLOOKUP(308,TextID,CODE(Language!$B$4)-64,FALSE),\"\"))","v":""},null,{"$f":"IF(E84=\"\",\"\",Report1!I$6)","v":""}]
[null,null,null,{"$f":"IF(E85=\"\",\"\",Customer!E$7)","v":""},null,"","",{"$f":"IF(E85=\"\",\"\",Report1!I$9)","v":""},null,{"$f":"CONCATENATE(IF(AND(E85<>\"\",OR(Report1!I$9=\"\",Report1!J$9=\"\")),VLOOKUP(300,TextID,CODE(Language!$B$4)-64,FALSE),\"\"),IF(AND(E85<>\"\",I85=\"\"),VLOOKUP(302,TextID,CODE(Language!$B$4)-64,FALSE),\"\"),IF(AND(E85=\"\",I85<>\"\"),VLOOKUP(306,TextID,CODE(Language!$B$4)-64,FALSE),\"\"),IF(AND(E85<>\"\",E85=E84),VLOOKUP(308,TextID,CODE(Language!$B$4)-64,FALSE),\"\"))","v":""},null,{"$f":"IF(E85=\"\",\"\",Report1!I$6)","v":""}]
[null,null,null,{"$f":"IF(E86=\"\",\"\",Customer!E$7)","v":""},null,"","",{"$f":"IF(E86=\"\",\"\",Report1!I$9)","v":""},null,{"$f":"CONCATENATE(IF(AND(E86<>\"\",OR(Report1!I$9=\"\",Report1!J$9=\"\")),VLOOKUP(300,TextID,CODE(Language!$B$4)-64,FALSE),\"\"),IF(AND(E86<>\"\",I86=\"\"),VLOOKUP(302,TextID,CODE(Language!$B$4)-64,FALSE),\"\"),IF(AND(E86=\"\",I86<>\"\"),VLOOKUP(306,TextID,CODE(Language!$B$4)-64,FALSE),\"\"),IF(AND(E86<>\"\",E86=E85),VLOOKUP(308,TextID,CODE(Language!$B$4)-64,FALSE),\"\"))","v":""},null,{"$f":"IF(E86=\"\",\"\",Report1!I$6)","v":""}]
[null,null,null,{"$f":"IF(E87=\"\",\"\",Customer!E$7)","v":""},null,"","",{"$f":"IF(E87=\"\",\"\",Report1!I$9)","v":""},null,{"$f":"CONCATENATE(IF(AND(E87<>\"\",OR(Report1!I$9=\"\",Report1!J$9=\"\")),VLOOKUP(300,TextID,CODE(Language!$B$4)-64,FALSE),\"\"),IF(AND(E87<>\"\",I87=\"\"),VLOOKUP(302,TextID,CODE(Language!$B$4)-64,FALSE),\"\"),IF(AND(E87=\"\",I87<>\"\"),VLOOKUP(306,TextID,CODE(Language!$B$4)-64,FALSE),\"\"),IF(AND(E87<>\"\",E87=E86),VLOOKUP(308,TextID,CODE(Language!$B$4)-64,FALSE),\"\"))","v":""},null,{"$f":"IF(E87=\"\",\"\",Report1!I$6)","v":""}]
[null,null,null,{"$f":"IF(E88=\"\",\"\",Customer!E$7)","v":""},null,"","",{"$f":"IF(E88=\"\",\"\",Report1!I$9)","v":""},null,{"$f":"CONCATENATE(IF(AND(E88<>\"\",OR(Report1!I$9=\"\",Report1!J$9=\"\")),VLOOKUP(300,TextID,CODE(Language!$B$4)-64,FALSE),\"\"),IF(AND(E88<>\"\",I88=\"\"),VLOOKUP(302,TextID,CODE(Language!$B$4)-64,FALSE),\"\"),IF(AND(E88=\"\",I88<>\"\"),VLOOKUP(306,TextID,CODE(Language!$B$4)-64,FALSE),\"\"),IF(AND(E88<>\"\",E88=E87),VLOOKUP(308,TextID,CODE(Language!$B$4)-64,FALSE),\"\"))","v":""},null,{"$f":"IF(E88=\"\",\"\",Report1!I$6)","v":""}]
[null,null,null,{"$f":"IF(E89=\"\",\"\",Customer!E$7)","v":""},null,"","",{"$f":"IF(E89=\"\",\"\",Report1!I$9)","v":""},null,{"$f":"CONCATENATE(IF(AND(E89<>\"\",OR(Report1!I$9=\"\",Report1!J$9=\"\")),VLOOKUP(300,TextID,CODE(Language!$B$4)-64,FALSE),\"\"),IF(AND(E89<>\"\",I89=\"\"),VLOOKUP(302,TextID,CODE(Language!$B$4)-64,FALSE),\"\"),IF(AND(E89=\"\",I89<>\"\"),VLOOKUP(306,TextID,CODE(Language!$B$4)-64,FALSE),\"\"),IF(AND(E89<>\"\",E89=E88),VLOOKUP(308,TextID,CODE(Language!$B$4)-64,FALSE),\"\"))","v":""},null,{"$f":"IF(E89=\"\",\"\",Report1!I$6)","v":""}]
[null,null,null,{"$f":"IF(E90=\"\",\"\",Customer!E$7)","v":""},null,"","",{"$f":"IF(E90=\"\",\"\",Report1!I$9)","v":""},null,{"$f":"CONCATENATE(IF(AND(E90<>\"\",OR(Report1!I$9=\"\",Report1!J$9=\"\")),VLOOKUP(300,TextID,CODE(Language!$B$4)-64,FALSE),\"\"),IF(AND(E90<>\"\",I90=\"\"),VLOOKUP(302,TextID,CODE(Language!$B$4)-64,FALSE),\"\"),IF(AND(E90=\"\",I90<>\"\"),VLOOKUP(306,TextID,CODE(Language!$B$4)-64,FALSE),\"\"),IF(AND(E90<>\"\",E90=E89),VLOOKUP(308,TextID,CODE(Language!$B$4)-64,FALSE),\"\"))","v":""},null,{"$f":"IF(E90=\"\",\"\",Report1!I$6)","v":""}]
[null,null,null,{"$f":"IF(E91=\"\",\"\",Customer!E$7)","v":""},null,"","",{"$f":"IF(E91=\"\",\"\",Report1!I$9)","v":""},null,{"$f":"CONCATENATE(IF(AND(E91<>\"\",OR(Report1!I$9=\"\",Report1!J$9=\"\")),VLOOKUP(300,TextID,CODE(Language!$B$4)-64,FALSE),\"\"),IF(AND(E91<>\"\",I91=\"\"),VLOOKUP(302,TextID,CODE(Language!$B$4)-64,FALSE),\"\"),IF(AND(E91=\"\",I91<>\"\"),VLOOKUP(306,TextID,CODE(Language!$B$4)-64,FALSE),\"\"),IF(AND(E91<>\"\",E91=E90),VLOOKUP(308,TextID,CODE(Language!$B$4)-64,FALSE),\"\"))","v":""},null,{"$f":"IF(E91=\"\",\"\",Report1!I$6)","v":""}]
[null,null,null,{"$f":"IF(E92=\"\",\"\",Customer!E$7)","v":""},null,"","",{"$f":"IF(E92=\"\",\"\",Report1!I$9)","v":""},null,{"$f":"CONCATENATE(IF(AND(E92<>\"\",OR(Report1!I$9=\"\",Report1!J$9=\"\")),VLOOKUP(300,TextID,CODE(Language!$B$4)-64,FALSE),\"\"),IF(AND(E92<>\"\",I92=\"\"),VLOOKUP(302,TextID,CODE(Language!$B$4)-64,FALSE),\"\"),IF(AND(E92=\"\",I92<>\"\"),VLOOKUP(306,TextID,CODE(Language!$B$4)-64,FALSE),\"\"),IF(AND(E92<>\"\",E92=E91),VLOOKUP(308,TextID,CODE(Language!$B$4)-64,FALSE),\"\"))","v":""},null,{"$f":"IF(E92=\"\",\"\",Report1!I$6)","v":""}]
[null,null,null,{"$f":"IF(E93=\"\",\"\",Customer!E$7)","v":""},null,"","",{"$f":"IF(E93=\"\",\"\",Report1!I$9)","v":""},null,{"$f":"CONCATENATE(IF(AND(E93<>\"\",OR(Report1!I$9=\"\",Report1!J$9=\"\")),VLOOKUP(300,TextID,CODE(Language!$B$4)-64,FALSE),\"\"),IF(AND(E93<>\"\",I93=\"\"),VLOOKUP(302,TextID,CODE(Language!$B$4)-64,FALSE),\"\"),IF(AND(E93=\"\",I93<>\"\"),VLOOKUP(306,TextID,CODE(Language!$B$4)-64,FALSE),\"\"),IF(AND(E93<>\"\",E93=E92),VLOOKUP(308,TextID,CODE(Language!$B$4)-64,FALSE),\"\"))","v":""},null,{"$f":"IF(E93=\"\",\"\",Report1!I$6)","v":""}]
[null,null,null,{"$f":"IF(E94=\"\",\"\",Customer!E$7)","v":""},null,"","",{"$f":"IF(E94=\"\",\"\",Report1!I$9)","v":""},null,{"$f":"CONCATENATE(IF(AND(E94<>\"\",OR(Report1!I$9=\"\",Report1!J$9=\"\")),VLOOKUP(300,TextID,CODE(Language!$B$4)-64,FALSE),\"\"),IF(AND(E94<>\"\",I94=\"\"),VLOOKUP(302,TextID,CODE(Language!$B$4)-64,FALSE),\"\"),IF(AND(E94=\"\",I94<>\"\"),VLOOKUP(306,TextID,CODE(Language!$B$4)-64,FALSE),\"\"),IF(AND(E94<>\"\",E94=E93),VLOOKUP(308,TextID,CODE(Language!$B$4)-64,FALSE),\"\"))","v":""},null,{"$f":"IF(E94=\"\",\"\",Report1!I$6)","v":""}]
[null,null,null,{"$f":"IF(E95=\"\",\"\",Customer!E$7)","v":""},null,"","",{"$f":"IF(E95=\"\",\"\",Report1!I$9)","v":""},null,{"$f":"CONCATENATE(IF(AND(E95<>\"\",OR(Report1!I$9=\"\",Report1!J$9=\"\")),VLOOKUP(300,TextID,CODE(Language!$B$4)-64,FALSE),\"\"),IF(AND(E95<>\"\",I95=\"\"),VLOOKUP(302,TextID,CODE(Language!$B$4)-64,FALSE),\"\"),IF(AND(E95=\"\",I95<>\"\"),VLOOKUP(306,TextID,CODE(Language!$B$4)-64,FALSE),\"\"),IF(AND(E95<>\"\",E95=E94),VLOOKUP(308,TextID,CODE(Language!$B$4)-64,FALSE),\"\"))","v":""},null,{"$f":"IF(E95=\"\",\"\",Report1!I$6)","v":""}]
[null,null,null,{"$f":"IF(E96=\"\",\"\",Customer!E$7)","v":""},null,"","",{"$f":"IF(E96=\"\",\"\",Report1!I$9)","v":""},null,{"$f":"CONCATENATE(IF(AND(E96<>\"\",OR(Report1!I$9=\"\",Report1!J$9=\"\")),VLOOKUP(300,TextID,CODE(Language!$B$4)-64,FALSE),\"\"),IF(AND(E96<>\"\",I96=\"\"),VLOOKUP(302,TextID,CODE(Language!$B$4)-64,FALSE),\"\"),IF(AND(E96=\"\",I96<>\"\"),VLOOKUP(306,TextID,CODE(Language!$B$4)-64,FALSE),\"\"),IF(AND(E96<>\"\",E96=E95),VLOOKUP(308,TextID,CODE(Language!$B$4)-64,FALSE),\"\"))","v":""},null,{"$f":"IF(E96=\"\",\"\",Report1!I$6)","v":""}]
[null,null,null,{"$f":"IF(E97=\"\",\"\",Customer!E$7)","v":""},null,"","",{"$f":"IF(E97=\"\",\"\",Report1!I$9)","v":""},null,{"$f":"CONCATENATE(IF(AND(E97<>\"\",OR(Report1!I$9=\"\",Report1!J$9=\"\")),VLOOKUP(300,TextID,CODE(Language!$B$4)-64,FALSE),\"\"),IF(AND(E97<>\"\",I97=\"\"),VLOOKUP(302,TextID,CODE(Language!$B$4)-64,FALSE),\"\"),IF(AND(E97=\"\",I97<>\"\"),VLOOKUP(306,TextID,CODE(Language!$B$4)-64,FALSE),\"\"),IF(AND(E97<>\"\",E97=E96),VLOOKUP(308,TextID,CODE(Language!$B$4)-64,FALSE),\"\"))","v":""},null,{"$f":"IF(E97=\"\",\"\",Report1!I$6)","v":""}]
[null,null,null,{"$f":"IF(E98=\"\",\"\",Customer!E$7)","v":""},null,"","",{"$f":"IF(E98=\"\",\"\",Report1!I$9)","v":""},null,{"$f":"CONCATENATE(IF(AND(E98<>\"\",OR(Report1!I$9=\"\",Report1!J$9=\"\")),VLOOKUP(300,TextID,CODE(Language!$B$4)-64,FALSE),\"\"),IF(AND(E98<>\"\",I98=\"\"),VLOOKUP(302,TextID,CODE(Language!$B$4)-64,FALSE),\"\"),IF(AND(E98=\"\",I98<>\"\"),VLOOKUP(306,TextID,CODE(Language!$B$4)-64,FALSE),\"\"),IF(AND(E98<>\"\",E98=E97),VLOOKUP(308,TextID,CODE(Language!$B$4)-64,FALSE),\"\"))","v":""},null,{"$f":"IF(E98=\"\",\"\",Report1!I$6)","v":""}]
[null,null,null,{"$f":"IF(E99=\"\",\"\",Customer!E$7)","v":""},null,"","",{"$f":"IF(E99=\"\",\"\",Report1!I$9)","v":""},null,{"$f":"CONCATENATE(IF(AND(E99<>\"\",OR(Report1!I$9=\"\",Report1!J$9=\"\")),VLOOKUP(300,TextID,CODE(Language!$B$4)-64,FALSE),\"\"),IF(AND(E99<>\"\",I99=\"\"),VLOOKUP(302,TextID,CODE(Language!$B$4)-64,FALSE),\"\"),IF(AND(E99=\"\",I99<>\"\"),VLOOKUP(306,TextID,CODE(Language!$B$4)-64,FALSE),\"\"),IF(AND(E99<>\"\",E99=E98),VLOOKUP(308,TextID,CODE(Language!$B$4)-64,FALSE),\"\"))","v":""},null,{"$f":"IF(E99=\"\",\"\",Report1!I$6)","v":""}]
[null,null,null,{"$f":"IF(E100=\"\",\"\",Customer!E$7)","v":""},null,"","",{"$f":"IF(E100=\"\",\"\",Report1!I$9)","v":""},null,{"$f":"CONCATENATE(IF(AND(E100<>\"\",OR(Report1!I$9=\"\",Report1!J$9=\"\")),VLOOKUP(300,TextID,CODE(Language!$B$4)-64,FALSE),\"\"),IF(AND(E100<>\"\",I100=\"\"),VLOOKUP(302,TextID,CODE(Language!$B$4)-64,FALSE),\"\"),IF(AND(E100=\"\",I100<>\"\"),VLOOKUP(306,TextID,CODE(Language!$B$4)-64,FALSE),\"\"),IF(AND(E100<>\"\",E100=E99),VLOOKUP(308,TextID,CODE(Language!$B$4)-64,FALSE),\"\"))","v":""},null,{"$f":"IF(E100=\"\",\"\",Report1!I$6)","v":""}]
[null,null,null,{"$f":"IF(E101=\"\",\"\",Customer!E$7)","v":""},null,"","",{"$f":"IF(E101=\"\",\"\",Report1!I$9)","v":""},null,{"$f":"CONCATENATE(IF(AND(E101<>\"\",OR(Report1!I$9=\"\",Report1!J$9=\"\")),VLOOKUP(300,TextID,CODE(Language!$B$4)-64,FALSE),\"\"),IF(AND(E101<>\"\",I101=\"\"),VLOOKUP(302,TextID,CODE(Language!$B$4)-64,FALSE),\"\"),IF(AND(E101=\"\",I101<>\"\"),VLOOKUP(306,TextID,CODE(Language!$B$4)-64,FALSE),\"\"),IF(AND(E101<>\"\",E101=E100),VLOOKUP(308,TextID,CODE(Language!$B$4)-64,FALSE),\"\"))","v":""},null,{"$f":"IF(E101=\"\",\"\",Report1!I$6)","v":""}]
[null,null,null,{"$f":"IF(E102=\"\",\"\",Customer!E$7)","v":""},null,"","",{"$f":"IF(E102=\"\",\"\",Report1!I$9)","v":""},null,{"$f":"CONCATENATE(IF(AND(E102<>\"\",OR(Report1!I$9=\"\",Report1!J$9=\"\")),VLOOKUP(300,TextID,CODE(Language!$B$4)-64,FALSE),\"\"),IF(AND(E102<>\"\",I102=\"\"),VLOOKUP(302,TextID,CODE(Language!$B$4)-64,FALSE),\"\"),IF(AND(E102=\"\",I102<>\"\"),VLOOKUP(306,TextID,CODE(Language!$B$4)-64,FALSE),\"\"),IF(AND(E102<>\"\",E102=E101),VLOOKUP(308,TextID,CODE(Language!$B$4)-64,FALSE),\"\"))","v":""},null,{"$f":"IF(E102=\"\",\"\",Report1!I$6)","v":""}]
[null,null,null,{"$f":"IF(E103=\"\",\"\",Customer!E$7)","v":""},null,"","",{"$f":"IF(E103=\"\",\"\",Report1!I$9)","v":""},null,{"$f":"CONCATENATE(IF(AND(E103<>\"\",OR(Report1!I$9=\"\",Report1!J$9=\"\")),VLOOKUP(300,TextID,CODE(Language!$B$4)-64,FALSE),\"\"),IF(AND(E103<>\"\",I103=\"\"),VLOOKUP(302,TextID,CODE(Language!$B$4)-64,FALSE),\"\"),IF(AND(E103=\"\",I103<>\"\"),VLOOKUP(306,TextID,CODE(Language!$B$4)-64,FALSE),\"\"),IF(AND(E103<>\"\",E103=E102),VLOOKUP(308,TextID,CODE(Language!$B$4)-64,FALSE),\"\"))","v":""},null,{"$f":"IF(E103=\"\",\"\",Report1!I$6)","v":""}]
[null,null,null,{"$f":"IF(E104=\"\",\"\",Customer!E$7)","v":""},null,"","",{"$f":"IF(E104=\"\",\"\",Report1!I$9)","v":""},null,{"$f":"CONCATENATE(IF(AND(E104<>\"\",OR(Report1!I$9=\"\",Report1!J$9=\"\")),VLOOKUP(300,TextID,CODE(Language!$B$4)-64,FALSE),\"\"),IF(AND(E104<>\"\",I104=\"\"),VLOOKUP(302,TextID,CODE(Language!$B$4)-64,FALSE),\"\"),IF(AND(E104=\"\",I104<>\"\"),VLOOKUP(306,TextID,CODE(Language!$B$4)-64,FALSE),\"\"),IF(AND(E104<>\"\",E104=E103),VLOOKUP(308,TextID,CODE(Language!$B$4)-64,FALSE),\"\"))","v":""},null,{"$f":"IF(E104=\"\",\"\",Report1!I$6)","v":""}]
[null,null,null,{"$f":"IF(E105=\"\",\"\",Customer!E$7)","v":""},null,"","",{"$f":"IF(E105=\"\",\"\",Report1!I$9)","v":""},null,{"$f":"CONCATENATE(IF(AND(E105<>\"\",OR(Report1!I$9=\"\",Report1!J$9=\"\")),VLOOKUP(300,TextID,CODE(Language!$B$4)-64,FALSE),\"\"),IF(AND(E105<>\"\",I105=\"\"),VLOOKUP(302,TextID,CODE(Language!$B$4)-64,FALSE),\"\"),IF(AND(E105=\"\",I105<>\"\"),VLOOKUP(306,TextID,CODE(Language!$B$4)-64,FALSE),\"\"),IF(AND(E105<>\"\",E105=E104),VLOOKUP(308,TextID,CODE(Language!$B$4)-64,FALSE),\"\"))","v":""},null,{"$f":"IF(E105=\"\",\"\",Report1!I$6)","v":""}]
[null,null,null,{"$f":"IF(E106=\"\",\"\",Customer!E$7)","v":""},null,"","",{"$f":"IF(E106=\"\",\"\",Report1!I$9)","v":""},null,{"$f":"CONCATENATE(IF(AND(E106<>\"\",OR(Report1!I$9=\"\",Report1!J$9=\"\")),VLOOKUP(300,TextID,CODE(Language!$B$4)-64,FALSE),\"\"),IF(AND(E106<>\"\",I106=\"\"),VLOOKUP(302,TextID,CODE(Language!$B$4)-64,FALSE),\"\"),IF(AND(E106=\"\",I106<>\"\"),VLOOKUP(306,TextID,CODE(Language!$B$4)-64,FALSE),\"\"),IF(AND(E106<>\"\",E106=E105),VLOOKUP(308,TextID,CODE(Language!$B$4)-64,FALSE),\"\"))","v":""},null,{"$f":"IF(E106=\"\",\"\",Report1!I$6)","v":""}]
[null,null,null,{"$f":"IF(E107=\"\",\"\",Customer!E$7)","v":""},null,"","",{"$f":"IF(E107=\"\",\"\",Report1!I$9)","v":""},null,{"$f":"CONCATENATE(IF(AND(E107<>\"\",OR(Report1!I$9=\"\",Report1!J$9=\"\")),VLOOKUP(300,TextID,CODE(Language!$B$4)-64,FALSE),\"\"),IF(AND(E107<>\"\",I107=\"\"),VLOOKUP(302,TextID,CODE(Language!$B$4)-64,FALSE),\"\"),IF(AND(E107=\"\",I107<>\"\"),VLOOKUP(306,TextID,CODE(Language!$B$4)-64,FALSE),\"\"),IF(AND(E107<>\"\",E107=E106),VLOOKUP(308,TextID,CODE(Language!$B$4)-64,FALSE),\"\"))","v":""},null,{"$f":"IF(E107=\"\",\"\",Report1!I$6)","v":""}]
[null,null,null,{"$f":"IF(E108=\"\",\"\",Customer!E$7)","v":""},null,"","",{"$f":"IF(E108=\"\",\"\",Report1!I$9)","v":""},null,{"$f":"CONCATENATE(IF(AND(E108<>\"\",OR(Report1!I$9=\"\",Report1!J$9=\"\")),VLOOKUP(300,TextID,CODE(Language!$B$4)-64,FALSE),\"\"),IF(AND(E108<>\"\",I108=\"\"),VLOOKUP(302,TextID,CODE(Language!$B$4)-64,FALSE),\"\"),IF(AND(E108=\"\",I108<>\"\"),VLOOKUP(306,TextID,CODE(Language!$B$4)-64,FALSE),\"\"),IF(AND(E108<>\"\",E108=E107),VLOOKUP(308,TextID,CODE(Language!$B$4)-64,FALSE),\"\"))","v":""},null,{"$f":"IF(E108=\"\",\"\",Report1!I$6)","v":""}]
[null,null,null,{"$f":"IF(E109=\"\",\"\",Customer!E$7)","v":""},null,{"$f":"IF($E109=\"\",\"\",VLOOKUP($E109,Material2b,2))","v":""},{"$f":"IF($E109=\"\",\"\",VLOOKUP($E109,Material2b,3))","v":""},{"$f":"IF(E109=\"\",\"\",Report1!I$9)","v":""},null,{"$f":"CONCATENATE(IF(AND(E109<>\"\",OR(Report1!I$9=\"\",Report1!J$9=\"\")),VLOOKUP(300,TextID,CODE(Language!$B$4)-64,FALSE),\"\"),IF(AND(E109<>\"\",I109=\"\"),VLOOKUP(302,TextID,CODE(Language!$B$4)-64,FALSE),\"\"),IF(AND(E109=\"\",I109<>\"\"),VLOOKUP(306,TextID,CODE(Language!$B$4)-64,FALSE),\"\"),IF(AND(E109<>\"\",E109=E108),VLOOKUP(308,TextID,CODE(Language!$B$4)-64,FALSE),\"\"))","v":""},null,{"$f":"IF(E109=\"\",\"\",Report1!I$6)","v":""}]
[null,null,null,{"$f":"IF(E110=\"\",\"\",Customer!E$7)","v":""},null,"","",{"$f":"IF(E110=\"\",\"\",Report1!I$9)","v":""},null,{"$f":"CONCATENATE(IF(AND(E110<>\"\",OR(Report1!I$9=\"\",Report1!J$9=\"\")),VLOOKUP(300,TextID,CODE(Language!$B$4)-64,FALSE),\"\"),IF(AND(E110<>\"\",I110=\"\"),VLOOKUP(302,TextID,CODE(Language!$B$4)-64,FALSE),\"\"),IF(AND(E110=\"\",I110<>\"\"),VLOOKUP(306,TextID,CODE(Language!$B$4)-64,FALSE),\"\"),IF(AND(E110<>\"\",E110=E109),VLOOKUP(308,TextID,CODE(Language!$B$4)-64,FALSE),\"\"))","v":""},null,{"$f":"IF(E110=\"\",\"\",Report1!I$6)","v":""}]
[null,null,null,{"$f":"IF(E111=\"\",\"\",Customer!E$7)","v":""},null,"","",{"$f":"IF(E111=\"\",\"\",Report1!I$9)","v":""},null,{"$f":"CONCATENATE(IF(AND(E111<>\"\",OR(Report1!I$9=\"\",Report1!J$9=\"\")),VLOOKUP(300,TextID,CODE(Language!$B$4)-64,FALSE),\"\"),IF(AND(E111<>\"\",I111=\"\"),VLOOKUP(302,TextID,CODE(Language!$B$4)-64,FALSE),\"\"),IF(AND(E111=\"\",I111<>\"\"),VLOOKUP(306,TextID,CODE(Language!$B$4)-64,FALSE),\"\"),IF(AND(E111<>\"\",E111=E110),VLOOKUP(308,TextID,CODE(Language!$B$4)-64,FALSE),\"\"))","v":""},null,{"$f":"IF(E111=\"\",\"\",Report1!I$6)","v":""}]
[null,null,null,{"$f":"IF(E112=\"\",\"\",Customer!E$7)","v":""},null,"","",{"$f":"IF(E112=\"\",\"\",Report1!I$9)","v":""},null,{"$f":"CONCATENATE(IF(AND(E112<>\"\",OR(Report1!I$9=\"\",Report1!J$9=\"\")),VLOOKUP(300,TextID,CODE(Language!$B$4)-64,FALSE),\"\"),IF(AND(E112<>\"\",I112=\"\"),VLOOKUP(302,TextID,CODE(Language!$B$4)-64,FALSE),\"\"),IF(AND(E112=\"\",I112<>\"\"),VLOOKUP(306,TextID,CODE(Language!$B$4)-64,FALSE),\"\"),IF(AND(E112<>\"\",E112=E111),VLOOKUP(308,TextID,CODE(Language!$B$4)-64,FALSE),\"\"))","v":""},null,{"$f":"IF(E112=\"\",\"\",Report1!I$6)","v":""}]
[null,null,null,{"$f":"IF(E113=\"\",\"\",Customer!E$7)","v":""},null,"","",{"$f":"IF(E113=\"\",\"\",Report1!I$9)","v":""},null,{"$f":"CONCATENATE(IF(AND(E113<>\"\",OR(Report1!I$9=\"\",Report1!J$9=\"\")),VLOOKUP(300,TextID,CODE(Language!$B$4)-64,FALSE),\"\"),IF(AND(E113<>\"\",I113=\"\"),VLOOKUP(302,TextID,CODE(Language!$B$4)-64,FALSE),\"\"),IF(AND(E113=\"\",I113<>\"\"),VLOOKUP(306,TextID,CODE(Language!$B$4)-64,FALSE),\"\"),IF(AND(E113<>\"\",E113=E112),VLOOKUP(308,TextID,CODE(Language!$B$4)-64,FALSE),\"\"))","v":""},null,{"$f":"IF(E113=\"\",\"\",Report1!I$6)","v":""}]
[null,null,null,{"$f":"IF(E114=\"\",\"\",Customer!E$7)","v":""},null,"","",{"$f":"IF(E114=\"\",\"\",Report1!I$9)","v":""},null,{"$f":"CONCATENATE(IF(AND(E114<>\"\",OR(Report1!I$9=\"\",Report1!J$9=\"\")),VLOOKUP(300,TextID,CODE(Language!$B$4)-64,FALSE),\"\"),IF(AND(E114<>\"\",I114=\"\"),VLOOKUP(302,TextID,CODE(Language!$B$4)-64,FALSE),\"\"),IF(AND(E114=\"\",I114<>\"\"),VLOOKUP(306,TextID,CODE(Language!$B$4)-64,FALSE),\"\"),IF(AND(E114<>\"\",E114=E113),VLOOKUP(308,TextID,CODE(Language!$B$4)-64,FALSE),\"\"))","v":""},null,{"$f":"IF(E114=\"\",\"\",Report1!I$6)","v":""}]
[null,null,null,{"$f":"IF(E115=\"\",\"\",Customer!E$7)","v":""},null,"","",{"$f":"IF(E115=\"\",\"\",Report1!I$9)","v":""},null,{"$f":"CONCATENATE(IF(AND(E115<>\"\",OR(Report1!I$9=\"\",Report1!J$9=\"\")),VLOOKUP(300,TextID,CODE(Language!$B$4)-64,FALSE),\"\"),IF(AND(E115<>\"\",I115=\"\"),VLOOKUP(302,TextID,CODE(Language!$B$4)-64,FALSE),\"\"),IF(AND(E115=\"\",I115<>\"\"),VLOOKUP(306,TextID,CODE(Language!$B$4)-64,FALSE),\"\"),IF(AND(E115<>\"\",E115=E114),VLOOKUP(308,TextID,CODE(Language!$B$4)-64,FALSE),\"\"))","v":""},null,{"$f":"IF(E115=\"\",\"\",Report1!I$6)","v":""}]
[null,null,null,{"$f":"IF(E116=\"\",\"\",Customer!E$7)","v":""},null,"","",{"$f":"IF(E116=\"\",\"\",Report1!I$9)","v":""},null,{"$f":"CONCATENATE(IF(AND(E116<>\"\",OR(Report1!I$9=\"\",Report1!J$9=\"\")),VLOOKUP(300,TextID,CODE(Language!$B$4)-64,FALSE),\"\"),IF(AND(E116<>\"\",I116=\"\"),VLOOKUP(302,TextID,CODE(Language!$B$4)-64,FALSE),\"\"),IF(AND(E116=\"\",I116<>\"\"),VLOOKUP(306,TextID,CODE(Language!$B$4)-64,FALSE),\"\"),IF(AND(E116<>\"\",E116=E115),VLOOKUP(308,TextID,CODE(Language!$B$4)-64,FALSE),\"\"))","v":""},null,{"$f":"IF(E116=\"\",\"\",Report1!I$6)","v":""}]
[null,null,null,{"$f":"IF(E117=\"\",\"\",Customer!E$7)","v":""},null,"","",{"$f":"IF(E117=\"\",\"\",Report1!I$9)","v":""},null,{"$f":"CONCATENATE(IF(AND(E117<>\"\",OR(Report1!I$9=\"\",Report1!J$9=\"\")),VLOOKUP(300,TextID,CODE(Language!$B$4)-64,FALSE),\"\"),IF(AND(E117<>\"\",I117=\"\"),VLOOKUP(302,TextID,CODE(Language!$B$4)-64,FALSE),\"\"),IF(AND(E117=\"\",I117<>\"\"),VLOOKUP(306,TextID,CODE(Language!$B$4)-64,FALSE),\"\"),IF(AND(E117<>\"\",E117=E116),VLOOKUP(308,TextID,CODE(Language!$B$4)-64,FALSE),\"\"))","v":""},null,{"$f":"IF(E117=\"\",\"\",Report1!I$6)","v":""}]
[null,null,null,{"$f":"IF(E118=\"\",\"\",Customer!E$7)","v":""},null,"","",{"$f":"IF(E118=\"\",\"\",Report1!I$9)","v":""},null,{"$f":"CONCATENATE(IF(AND(E118<>\"\",OR(Report1!I$9=\"\",Report1!J$9=\"\")),VLOOKUP(300,TextID,CODE(Language!$B$4)-64,FALSE),\"\"),IF(AND(E118<>\"\",I118=\"\"),VLOOKUP(302,TextID,CODE(Language!$B$4)-64,FALSE),\"\"),IF(AND(E118=\"\",I118<>\"\"),VLOOKUP(306,TextID,CODE(Language!$B$4)-64,FALSE),\"\"),IF(AND(E118<>\"\",E118=E117),VLOOKUP(308,TextID,CODE(Language!$B$4)-64,FALSE),\"\"))","v":""},null,{"$f":"IF(E118=\"\",\"\",Report1!I$6)","v":""}]
[null,null,null,{"$f":"IF(E119=\"\",\"\",Customer!E$7)","v":""},null,"","",{"$f":"IF(E119=\"\",\"\",Report1!I$9)","v":""},null,{"$f":"CONCATENATE(IF(AND(E119<>\"\",OR(Report1!I$9=\"\",Report1!J$9=\"\")),VLOOKUP(300,TextID,CODE(Language!$B$4)-64,FALSE),\"\"),IF(AND(E119<>\"\",I119=\"\"),VLOOKUP(302,TextID,CODE(Language!$B$4)-64,FALSE),\"\"),IF(AND(E119=\"\",I119<>\"\"),VLOOKUP(306,TextID,CODE(Language!$B$4)-64,FALSE),\"\"),IF(AND(E119<>\"\",E119=E118),VLOOKUP(308,TextID,CODE(Language!$B$4)-64,FALSE),\"\"))","v":""},null,{"$f":"IF(E119=\"\",\"\",Report1!I$6)","v":""}]
[null,null,null,{"$f":"IF(E120=\"\",\"\",Customer!E$7)","v":""},null,"","",{"$f":"IF(E120=\"\",\"\",Report1!I$9)","v":""},null,{"$f":"CONCATENATE(IF(AND(E120<>\"\",OR(Report1!I$9=\"\",Report1!J$9=\"\")),VLOOKUP(300,TextID,CODE(Language!$B$4)-64,FALSE),\"\"),IF(AND(E120<>\"\",I120=\"\"),VLOOKUP(302,TextID,CODE(Language!$B$4)-64,FALSE),\"\"),IF(AND(E120=\"\",I120<>\"\"),VLOOKUP(306,TextID,CODE(Language!$B$4)-64,FALSE),\"\"),IF(AND(E120<>\"\",E120=E119),VLOOKUP(308,TextID,CODE(Language!$B$4)-64,FALSE),\"\"))","v":""},null,{"$f":"IF(E120=\"\",\"\",Report1!I$6)","v":""}]
[null,null,null,{"$f":"IF(E121=\"\",\"\",Customer!E$7)","v":""},null,"","",{"$f":"IF(E121=\"\",\"\",Report1!I$9)","v":""},null,{"$f":"CONCATENATE(IF(AND(E121<>\"\",OR(Report1!I$9=\"\",Report1!J$9=\"\")),VLOOKUP(300,TextID,CODE(Language!$B$4)-64,FALSE),\"\"),IF(AND(E121<>\"\",I121=\"\"),VLOOKUP(302,TextID,CODE(Language!$B$4)-64,FALSE),\"\"),IF(AND(E121=\"\",I121<>\"\"),VLOOKUP(306,TextID,CODE(Language!$B$4)-64,FALSE),\"\"),IF(AND(E121<>\"\",E121=E120),VLOOKUP(308,TextID,CODE(Language!$B$4)-64,FALSE),\"\"))","v":""},null,{"$f":"IF(E121=\"\",\"\",Report1!I$6)","v":""}]
[null,null,null,{"$f":"IF(E122=\"\",\"\",Customer!E$7)","v":""},null,"","",{"$f":"IF(E122=\"\",\"\",Report1!I$9)","v":""},null,{"$f":"CONCATENATE(IF(AND(E122<>\"\",OR(Report1!I$9=\"\",Report1!J$9=\"\")),VLOOKUP(300,TextID,CODE(Language!$B$4)-64,FALSE),\"\"),IF(AND(E122<>\"\",I122=\"\"),VLOOKUP(302,TextID,CODE(Language!$B$4)-64,FALSE),\"\"),IF(AND(E122=\"\",I122<>\"\"),VLOOKUP(306,TextID,CODE(Language!$B$4)-64,FALSE),\"\"),IF(AND(E122<>\"\",E122=E121),VLOOKUP(308,TextID,CODE(Language!$B$4)-64,FALSE),\"\"))","v":""},null,{"$f":"IF(E122=\"\",\"\",Report1!I$6)","v":""}]
[null,null,null,{"$f":"IF(E123=\"\",\"\",Customer!E$7)","v":""},null,"","",{"$f":"IF(E123=\"\",\"\",Report1!I$9)","v":""},null,{"$f":"CONCATENATE(IF(AND(E123<>\"\",OR(Report1!I$9=\"\",Report1!J$9=\"\")),VLOOKUP(300,TextID,CODE(Language!$B$4)-64,FALSE),\"\"),IF(AND(E123<>\"\",I123=\"\"),VLOOKUP(302,TextID,CODE(Language!$B$4)-64,FALSE),\"\"),IF(AND(E123=\"\",I123<>\"\"),VLOOKUP(306,TextID,CODE(Language!$B$4)-64,FALSE),\"\"),IF(AND(E123<>\"\",E123=E122),VLOOKUP(308,TextID,CODE(Language!$B$4)-64,FALSE),\"\"))","v":""},null,{"$f":"IF(E123=\"\",\"\",Report1!I$6)","v":""}]
[null,null,null,{"$f":"IF(E124=\"\",\"\",Customer!E$7)","v":""},null,"","",{"$f":"IF(E124=\"\",\"\",Report1!I$9)","v":""},null,{"$f":"CONCATENATE(IF(AND(E124<>\"\",OR(Report1!I$9=\"\",Report1!J$9=\"\")),VLOOKUP(300,TextID,CODE(Language!$B$4)-64,FALSE),\"\"),IF(AND(E124<>\"\",I124=\"\"),VLOOKUP(302,TextID,CODE(Language!$B$4)-64,FALSE),\"\"),IF(AND(E124=\"\",I124<>\"\"),VLOOKUP(306,TextID,CODE(Language!$B$4)-64,FALSE),\"\"),IF(AND(E124<>\"\",E124=E123),VLOOKUP(308,TextID,CODE(Language!$B$4)-64,FALSE),\"\"))","v":""},null,{"$f":"IF(E124=\"\",\"\",Report1!I$6)","v":""}]
[null,null,null,{"$f":"IF(E125=\"\",\"\",Customer!E$7)","v":""},null,"","",{"$f":"IF(E125=\"\",\"\",Report1!I$9)","v":""},null,{"$f":"CONCATENATE(IF(AND(E125<>\"\",OR(Report1!I$9=\"\",Report1!J$9=\"\")),VLOOKUP(300,TextID,CODE(Language!$B$4)-64,FALSE),\"\"),IF(AND(E125<>\"\",I125=\"\"),VLOOKUP(302,TextID,CODE(Language!$B$4)-64,FALSE),\"\"),IF(AND(E125=\"\",I125<>\"\"),VLOOKUP(306,TextID,CODE(Language!$B$4)-64,FALSE),\"\"),IF(AND(E125<>\"\",E125=E124),VLOOKUP(308,TextID,CODE(Language!$B$4)-64,FALSE),\"\"))","v":""},null,{"$f":"IF(E125=\"\",\"\",Report1!I$6)","v":""}]
[null,null,null,{"$f":"IF(E126=\"\",\"\",Customer!E$7)","v":""},null,"","",{"$f":"IF(E126=\"\",\"\",Report1!I$9)","v":""},null,{"$f":"CONCATENATE(IF(AND(E126<>\"\",OR(Report1!I$9=\"\",Report1!J$9=\"\")),VLOOKUP(300,TextID,CODE(Language!$B$4)-64,FALSE),\"\"),IF(AND(E126<>\"\",I126=\"\"),VLOOKUP(302,TextID,CODE(Language!$B$4)-64,FALSE),\"\"),IF(AND(E126=\"\",I126<>\"\"),VLOOKUP(306,TextID,CODE(Language!$B$4)-64,FALSE),\"\"),IF(AND(E126<>\"\",E126=E125),VLOOKUP(308,TextID,CODE(Language!$B$4)-64,FALSE),\"\"))","v":""},null,{"$f":"IF(E126=\"\",\"\",Report1!I$6)","v":""}]
[null,null,null,{"$f":"IF(E127=\"\",\"\",Customer!E$7)","v":""},null,"","",{"$f":"IF(E127=\"\",\"\",Report1!I$9)","v":""},null,{"$f":"CONCATENATE(IF(AND(E127<>\"\",OR(Report1!I$9=\"\",Report1!J$9=\"\")),VLOOKUP(300,TextID,CODE(Language!$B$4)-64,FALSE),\"\"),IF(AND(E127<>\"\",I127=\"\"),VLOOKUP(302,TextID,CODE(Language!$B$4)-64,FALSE),\"\"),IF(AND(E127=\"\",I127<>\"\"),VLOOKUP(306,TextID,CODE(Language!$B$4)-64,FALSE),\"\"),IF(AND(E127<>\"\",E127=E126),VLOOKUP(308,TextID,CODE(Language!$B$4)-64,FALSE),\"\"))","v":""},null,{"$f":"IF(E127=\"\",\"\",Report1!I$6)","v":""}]
[null,null,null,{"$f":"IF(E128=\"\",\"\",Customer!E$7)","v":""},null,"","",{"$f":"IF(E128=\"\",\"\",Report1!I$9)","v":""},null,{"$f":"CONCATENATE(IF(AND(E128<>\"\",OR(Report1!I$9=\"\",Report1!J$9=\"\")),VLOOKUP(300,TextID,CODE(Language!$B$4)-64,FALSE),\"\"),IF(AND(E128<>\"\",I128=\"\"),VLOOKUP(302,TextID,CODE(Language!$B$4)-64,FALSE),\"\"),IF(AND(E128=\"\",I128<>\"\"),VLOOKUP(306,TextID,CODE(Language!$B$4)-64,FALSE),\"\"),IF(AND(E128<>\"\",E128=E127),VLOOKUP(308,TextID,CODE(Language!$B$4)-64,FALSE),\"\"))","v":""},null,{"$f":"IF(E128=\"\",\"\",Report1!I$6)","v":""}]
[null,null,null,{"$f":"IF(E129=\"\",\"\",Customer!E$7)","v":""},null,"","",{"$f":"IF(E129=\"\",\"\",Report1!I$9)","v":""},null,{"$f":"CONCATENATE(IF(AND(E129<>\"\",OR(Report1!I$9=\"\",Report1!J$9=\"\")),VLOOKUP(300,TextID,CODE(Language!$B$4)-64,FALSE),\"\"),IF(AND(E129<>\"\",I129=\"\"),VLOOKUP(302,TextID,CODE(Language!$B$4)-64,FALSE),\"\"),IF(AND(E129=\"\",I129<>\"\"),VLOOKUP(306,TextID,CODE(Language!$B$4)-64,FALSE),\"\"),IF(AND(E129<>\"\",E129=E128),VLOOKUP(308,TextID,CODE(Language!$B$4)-64,FALSE),\"\"))","v":""},null,{"$f":"IF(E129=\"\",\"\",Report1!I$6)","v":""}]
[null,null,null,{"$f":"IF(E130=\"\",\"\",Customer!E$7)","v":""},null,"","",{"$f":"IF(E130=\"\",\"\",Report1!I$9)","v":""},null,{"$f":"CONCATENATE(IF(AND(E130<>\"\",OR(Report1!I$9=\"\",Report1!J$9=\"\")),VLOOKUP(300,TextID,CODE(Language!$B$4)-64,FALSE),\"\"),IF(AND(E130<>\"\",I130=\"\"),VLOOKUP(302,TextID,CODE(Language!$B$4)-64,FALSE),\"\"),IF(AND(E130=\"\",I130<>\"\"),VLOOKUP(306,TextID,CODE(Language!$B$4)-64,FALSE),\"\"),IF(AND(E130<>\"\",E130=E129),VLOOKUP(308,TextID,CODE(Language!$B$4)-64,FALSE),\"\"))","v":""},null,{"$f":"IF(E130=\"\",\"\",Report1!I$6)","v":""}]
[null,null,null,{"$f":"IF(E131=\"\",\"\",Customer!E$7)","v":""},null,"","",{"$f":"IF(E131=\"\",\"\",Report1!I$9)","v":""},null,{"$f":"CONCATENATE(IF(AND(E131<>\"\",OR(Report1!I$9=\"\",Report1!J$9=\"\")),VLOOKUP(300,TextID,CODE(Language!$B$4)-64,FALSE),\"\"),IF(AND(E131<>\"\",I131=\"\"),VLOOKUP(302,TextID,CODE(Language!$B$4)-64,FALSE),\"\"),IF(AND(E131=\"\",I131<>\"\"),VLOOKUP(306,TextID,CODE(Language!$B$4)-64,FALSE),\"\"),IF(AND(E131<>\"\",E131=E130),VLOOKUP(308,TextID,CODE(Language!$B$4)-64,FALSE),\"\"))","v":""},null,{"$f":"IF(E131=\"\",\"\",Report1!I$6)","v":""}]
[null,null,null,{"$f":"IF(E132=\"\",\"\",Customer!E$7)","v":""},null,"","",{"$f":"IF(E132=\"\",\"\",Report1!I$9)","v":""},null,{"$f":"CONCATENATE(IF(AND(E132<>\"\",OR(Report1!I$9=\"\",Report1!J$9=\"\")),VLOOKUP(300,TextID,CODE(Language!$B$4)-64,FALSE),\"\"),IF(AND(E132<>\"\",I132=\"\"),VLOOKUP(302,TextID,CODE(Language!$B$4)-64,FALSE),\"\"),IF(AND(E132=\"\",I132<>\"\"),VLOOKUP(306,TextID,CODE(Language!$B$4)-64,FALSE),\"\"),IF(AND(E132<>\"\",E132=E131),VLOOKUP(308,TextID,CODE(Language!$B$4)-64,FALSE),\"\"))","v":""},null,{"$f":"IF(E132=\"\",\"\",Report1!I$6)","v":""}]
[null,null,null,{"$f":"IF(E133=\"\",\"\",Customer!E$7)","v":""},null,"","",{"$f":"IF(E133=\"\",\"\",Report1!I$9)","v":""},null,{"$f":"CONCATENATE(IF(AND(E133<>\"\",OR(Report1!I$9=\"\",Report1!J$9=\"\")),VLOOKUP(300,TextID,CODE(Language!$B$4)-64,FALSE),\"\"),IF(AND(E133<>\"\",I133=\"\"),VLOOKUP(302,TextID,CODE(Language!$B$4)-64,FALSE),\"\"),IF(AND(E133=\"\",I133<>\"\"),VLOOKUP(306,TextID,CODE(Language!$B$4)-64,FALSE),\"\"),IF(AND(E133<>\"\",E133=E132),VLOOKUP(308,TextID,CODE(Language!$B$4)-64,FALSE),\"\"))","v":""},null,{"$f":"IF(E133=\"\",\"\",Report1!I$6)","v":""}]
[null,null,null,{"$f":"IF(E134=\"\",\"\",Customer!E$7)","v":""},null,"","",{"$f":"IF(E134=\"\",\"\",Report1!I$9)","v":""},null,{"$f":"CONCATENATE(IF(AND(E134<>\"\",OR(Report1!I$9=\"\",Report1!J$9=\"\")),VLOOKUP(300,TextID,CODE(Language!$B$4)-64,FALSE),\"\"),IF(AND(E134<>\"\",I134=\"\"),VLOOKUP(302,TextID,CODE(Language!$B$4)-64,FALSE),\"\"),IF(AND(E134=\"\",I134<>\"\"),VLOOKUP(306,TextID,CODE(Language!$B$4)-64,FALSE),\"\"),IF(AND(E134<>\"\",E134=E133),VLOOKUP(308,TextID,CODE(Language!$B$4)-64,FALSE),\"\"))","v":""},null,{"$f":"IF(E134=\"\",\"\",Report1!I$6)","v":""}]
[null,null,null,{"$f":"IF(E135=\"\",\"\",Customer!E$7)","v":""},null,"","",{"$f":"IF(E135=\"\",\"\",Report1!I$9)","v":""},null,{"$f":"CONCATENATE(IF(AND(E135<>\"\",OR(Report1!I$9=\"\",Report1!J$9=\"\")),VLOOKUP(300,TextID,CODE(Language!$B$4)-64,FALSE),\"\"),IF(AND(E135<>\"\",I135=\"\"),VLOOKUP(302,TextID,CODE(Language!$B$4)-64,FALSE),\"\"),IF(AND(E135=\"\",I135<>\"\"),VLOOKUP(306,TextID,CODE(Language!$B$4)-64,FALSE),\"\"),IF(AND(E135<>\"\",E135=E134),VLOOKUP(308,TextID,CODE(Language!$B$4)-64,FALSE),\"\"))","v":""},null,{"$f":"IF(E135=\"\",\"\",Report1!I$6)","v":""}]
[null,null,null,{"$f":"IF(E136=\"\",\"\",Customer!E$7)","v":""},null,"","",{"$f":"IF(E136=\"\",\"\",Report1!I$9)","v":""},null,{"$f":"CONCATENATE(IF(AND(E136<>\"\",OR(Report1!I$9=\"\",Report1!J$9=\"\")),VLOOKUP(300,TextID,CODE(Language!$B$4)-64,FALSE),\"\"),IF(AND(E136<>\"\",I136=\"\"),VLOOKUP(302,TextID,CODE(Language!$B$4)-64,FALSE),\"\"),IF(AND(E136=\"\",I136<>\"\"),VLOOKUP(306,TextID,CODE(Language!$B$4)-64,FALSE),\"\"),IF(AND(E136<>\"\",E136=E135),VLOOKUP(308,TextID,CODE(Language!$B$4)-64,FALSE),\"\"))","v":""},null,{"$f":"IF(E136=\"\",\"\",Report1!I$6)","v":""}]
[null,null,null,{"$f":"IF(E137=\"\",\"\",Customer!E$7)","v":""},null,"","",{"$f":"IF(E137=\"\",\"\",Report1!I$9)","v":""},null,{"$f":"CONCATENATE(IF(AND(E137<>\"\",OR(Report1!I$9=\"\",Report1!J$9=\"\")),VLOOKUP(300,TextID,CODE(Language!$B$4)-64,FALSE),\"\"),IF(AND(E137<>\"\",I137=\"\"),VLOOKUP(302,TextID,CODE(Language!$B$4)-64,FALSE),\"\"),IF(AND(E137=\"\",I137<>\"\"),VLOOKUP(306,TextID,CODE(Language!$B$4)-64,FALSE),\"\"),IF(AND(E137<>\"\",E137=E136),VLOOKUP(308,TextID,CODE(Language!$B$4)-64,FALSE),\"\"))","v":""},null,{"$f":"IF(E137=\"\",\"\",Report1!I$6)","v":""}]
[null,null,null,{"$f":"IF(E138=\"\",\"\",Customer!E$7)","v":""},null,"","",{"$f":"IF(E138=\"\",\"\",Report1!I$9)","v":""},null,{"$f":"CONCATENATE(IF(AND(E138<>\"\",OR(Report1!I$9=\"\",Report1!J$9=\"\")),VLOOKUP(300,TextID,CODE(Language!$B$4)-64,FALSE),\"\"),IF(AND(E138<>\"\",I138=\"\"),VLOOKUP(302,TextID,CODE(Language!$B$4)-64,FALSE),\"\"),IF(AND(E138=\"\",I138<>\"\"),VLOOKUP(306,TextID,CODE(Language!$B$4)-64,FALSE),\"\"),IF(AND(E138<>\"\",E138=E137),VLOOKUP(308,TextID,CODE(Language!$B$4)-64,FALSE),\"\"))","v":""},null,{"$f":"IF(E138=\"\",\"\",Report1!I$6)","v":""}]
[null,null,null,{"$f":"IF(E139=\"\",\"\",Customer!E$7)","v":""},null,"","",{"$f":"IF(E139=\"\",\"\",Report1!I$9)","v":""},null,{"$f":"CONCATENATE(IF(AND(E139<>\"\",OR(Report1!I$9=\"\",Report1!J$9=\"\")),VLOOKUP(300,TextID,CODE(Language!$B$4)-64,FALSE),\"\"),IF(AND(E139<>\"\",I139=\"\"),VLOOKUP(302,TextID,CODE(Language!$B$4)-64,FALSE),\"\"),IF(AND(E139=\"\",I139<>\"\"),VLOOKUP(306,TextID,CODE(Language!$B$4)-64,FALSE),\"\"),IF(AND(E139<>\"\",E139=E138),VLOOKUP(308,TextID,CODE(Language!$B$4)-64,FALSE),\"\"))","v":""},null,{"$f":"IF(E139=\"\",\"\",Report1!I$6)","v":""}]
[null,null,null,{"$f":"IF(E140=\"\",\"\",Customer!E$7)","v":""},null,"","",{"$f":"IF(E140=\"\",\"\",Report1!I$9)","v":""},null,{"$f":"CONCATENATE(IF(AND(E140<>\"\",OR(Report1!I$9=\"\",Report1!J$9=\"\")),VLOOKUP(300,TextID,CODE(Language!$B$4)-64,FALSE),\"\"),IF(AND(E140<>\"\",I140=\"\"),VLOOKUP(302,TextID,CODE(Language!$B$4)-64,FALSE),\"\"),IF(AND(E140=\"\",I140<>\"\"),VLOOKUP(306,TextID,CODE(Language!$B$4)-64,FALSE),\"\"),IF(AND(E140<>\"\",E140=E139),VLOOKUP(308,TextID,CODE(Language!$B$4)-64,FALSE),\"\"))","v":""},null,{"$f":"IF(E140=\"\",\"\",Report1!I$6)","v":""}]
[null,null,null,{"$f":"IF(E141=\"\",\"\",Customer!E$7)","v":""},null,{"$f":"IF($E141=\"\",\"\",VLOOKUP($E141,Material2b,2))","v":""},{"$f":"IF($E141=\"\",\"\",VLOOKUP($E141,Material2b,3))","v":""},{"$f":"IF(E141=\"\",\"\",Report1!I$9)","v":""},null,{"$f":"CONCATENATE(IF(AND(E141<>\"\",OR(Report1!I$9=\"\",Report1!J$9=\"\")),VLOOKUP(300,TextID,CODE(Language!$B$4)-64,FALSE),\"\"),IF(AND(E141<>\"\",I141=\"\"),VLOOKUP(302,TextID,CODE(Language!$B$4)-64,FALSE),\"\"),IF(AND(E141=\"\",I141<>\"\"),VLOOKUP(306,TextID,CODE(Language!$B$4)-64,FALSE),\"\"),IF(AND(E141<>\"\",E141=E140),VLOOKUP(308,TextID,CODE(Language!$B$4)-64,FALSE),\"\"))","v":""},null,{"$f":"IF(E141=\"\",\"\",Report1!I$6)","v":""}]
[null,null,null,{"$f":"IF(E142=\"\",\"\",Customer!E$7)","v":""},null,"","",{"$f":"IF(E142=\"\",\"\",Report1!I$9)","v":""},null,{"$f":"CONCATENATE(IF(AND(E142<>\"\",OR(Report1!I$9=\"\",Report1!J$9=\"\")),VLOOKUP(300,TextID,CODE(Language!$B$4)-64,FALSE),\"\"),IF(AND(E142<>\"\",I142=\"\"),VLOOKUP(302,TextID,CODE(Language!$B$4)-64,FALSE),\"\"),IF(AND(E142=\"\",I142<>\"\"),VLOOKUP(306,TextID,CODE(Language!$B$4)-64,FALSE),\"\"),IF(AND(E142<>\"\",E142=E141),VLOOKUP(308,TextID,CODE(Language!$B$4)-64,FALSE),\"\"))","v":""},null,{"$f":"IF(E142=\"\",\"\",Report1!I$6)","v":""}]
[null,null,null,{"$f":"IF(E143=\"\",\"\",Customer!E$7)","v":""},null,"","",{"$f":"IF(E143=\"\",\"\",Report1!I$9)","v":""},null,{"$f":"CONCATENATE(IF(AND(E143<>\"\",OR(Report1!I$9=\"\",Report1!J$9=\"\")),VLOOKUP(300,TextID,CODE(Language!$B$4)-64,FALSE),\"\"),IF(AND(E143<>\"\",I143=\"\"),VLOOKUP(302,TextID,CODE(Language!$B$4)-64,FALSE),\"\"),IF(AND(E143=\"\",I143<>\"\"),VLOOKUP(306,TextID,CODE(Language!$B$4)-64,FALSE),\"\"),IF(AND(E143<>\"\",E143=E142),VLOOKUP(308,TextID,CODE(Language!$B$4)-64,FALSE),\"\"))","v":""},null,{"$f":"IF(E143=\"\",\"\",Report1!I$6)","v":""}]
[null,null,null,{"$f":"IF(E144=\"\",\"\",Customer!E$7)","v":""},null,"","",{"$f":"IF(E144=\"\",\"\",Report1!I$9)","v":""},null,{"$f":"CONCATENATE(IF(AND(E144<>\"\",OR(Report1!I$9=\"\",Report1!J$9=\"\")),VLOOKUP(300,TextID,CODE(Language!$B$4)-64,FALSE),\"\"),IF(AND(E144<>\"\",I144=\"\"),VLOOKUP(302,TextID,CODE(Language!$B$4)-64,FALSE),\"\"),IF(AND(E144=\"\",I144<>\"\"),VLOOKUP(306,TextID,CODE(Language!$B$4)-64,FALSE),\"\"),IF(AND(E144<>\"\",E144=E143),VLOOKUP(308,TextID,CODE(Language!$B$4)-64,FALSE),\"\"))","v":""},null,{"$f":"IF(E144=\"\",\"\",Report1!I$6)","v":""}]
[null,null,null,{"$f":"IF(E145=\"\",\"\",Customer!E$7)","v":""},null,"","",{"$f":"IF(E145=\"\",\"\",Report1!I$9)","v":""},null,{"$f":"CONCATENATE(IF(AND(E145<>\"\",OR(Report1!I$9=\"\",Report1!J$9=\"\")),VLOOKUP(300,TextID,CODE(Language!$B$4)-64,FALSE),\"\"),IF(AND(E145<>\"\",I145=\"\"),VLOOKUP(302,TextID,CODE(Language!$B$4)-64,FALSE),\"\"),IF(AND(E145=\"\",I145<>\"\"),VLOOKUP(306,TextID,CODE(Language!$B$4)-64,FALSE),\"\"),IF(AND(E145<>\"\",E145=E144),VLOOKUP(308,TextID,CODE(Language!$B$4)-64,FALSE),\"\"))","v":""},null,{"$f":"IF(E145=\"\",\"\",Report1!I$6)","v":""}]
[null,null,null,{"$f":"IF(E146=\"\",\"\",Customer!E$7)","v":""},null,"","",{"$f":"IF(E146=\"\",\"\",Report1!I$9)","v":""},null,{"$f":"CONCATENATE(IF(AND(E146<>\"\",OR(Report1!I$9=\"\",Report1!J$9=\"\")),VLOOKUP(300,TextID,CODE(Language!$B$4)-64,FALSE),\"\"),IF(AND(E146<>\"\",I146=\"\"),VLOOKUP(302,TextID,CODE(Language!$B$4)-64,FALSE),\"\"),IF(AND(E146=\"\",I146<>\"\"),VLOOKUP(306,TextID,CODE(Language!$B$4)-64,FALSE),\"\"),IF(AND(E146<>\"\",E146=E145),VLOOKUP(308,TextID,CODE(Language!$B$4)-64,FALSE),\"\"))","v":""},null,{"$f":"IF(E146=\"\",\"\",Report1!I$6)","v":""}]
[null,null,null,{"$f":"IF(E147=\"\",\"\",Customer!E$7)","v":""},null,"","",{"$f":"IF(E147=\"\",\"\",Report1!I$9)","v":""},null,{"$f":"CONCATENATE(IF(AND(E147<>\"\",OR(Report1!I$9=\"\",Report1!J$9=\"\")),VLOOKUP(300,TextID,CODE(Language!$B$4)-64,FALSE),\"\"),IF(AND(E147<>\"\",I147=\"\"),VLOOKUP(302,TextID,CODE(Language!$B$4)-64,FALSE),\"\"),IF(AND(E147=\"\",I147<>\"\"),VLOOKUP(306,TextID,CODE(Language!$B$4)-64,FALSE),\"\"),IF(AND(E147<>\"\",E147=E146),VLOOKUP(308,TextID,CODE(Language!$B$4)-64,FALSE),\"\"))","v":""},null,{"$f":"IF(E147=\"\",\"\",Report1!I$6)","v":""}]
[null,null,null,{"$f":"IF(E148=\"\",\"\",Customer!E$7)","v":""},null,"","",{"$f":"IF(E148=\"\",\"\",Report1!I$9)","v":""},null,{"$f":"CONCATENATE(IF(AND(E148<>\"\",OR(Report1!I$9=\"\",Report1!J$9=\"\")),VLOOKUP(300,TextID,CODE(Language!$B$4)-64,FALSE),\"\"),IF(AND(E148<>\"\",I148=\"\"),VLOOKUP(302,TextID,CODE(Language!$B$4)-64,FALSE),\"\"),IF(AND(E148=\"\",I148<>\"\"),VLOOKUP(306,TextID,CODE(Language!$B$4)-64,FALSE),\"\"),IF(AND(E148<>\"\",E148=E147),VLOOKUP(308,TextID,CODE(Language!$B$4)-64,FALSE),\"\"))","v":""},null,{"$f":"IF(E148=\"\",\"\",Report1!I$6)","v":""}]
[null,null,null,{"$f":"IF(E149=\"\",\"\",Customer!E$7)","v":""},null,"","",{"$f":"IF(E149=\"\",\"\",Report1!I$9)","v":""},null,{"$f":"CONCATENATE(IF(AND(E149<>\"\",OR(Report1!I$9=\"\",Report1!J$9=\"\")),VLOOKUP(300,TextID,CODE(Language!$B$4)-64,FALSE),\"\"),IF(AND(E149<>\"\",I149=\"\"),VLOOKUP(302,TextID,CODE(Language!$B$4)-64,FALSE),\"\"),IF(AND(E149=\"\",I149<>\"\"),VLOOKUP(306,TextID,CODE(Language!$B$4)-64,FALSE),\"\"),IF(AND(E149<>\"\",E149=E148),VLOOKUP(308,TextID,CODE(Language!$B$4)-64,FALSE),\"\"))","v":""},null,{"$f":"IF(E149=\"\",\"\",Report1!I$6)","v":""}]
[null,null,null,{"$f":"IF(E150=\"\",\"\",Customer!E$7)","v":""},null,"","",{"$f":"IF(E150=\"\",\"\",Report1!I$9)","v":""},null,{"$f":"CONCATENATE(IF(AND(E150<>\"\",OR(Report1!I$9=\"\",Report1!J$9=\"\")),VLOOKUP(300,TextID,CODE(Language!$B$4)-64,FALSE),\"\"),IF(AND(E150<>\"\",I150=\"\"),VLOOKUP(302,TextID,CODE(Language!$B$4)-64,FALSE),\"\"),IF(AND(E150=\"\",I150<>\"\"),VLOOKUP(306,TextID,CODE(Language!$B$4)-64,FALSE),\"\"),IF(AND(E150<>\"\",E150=E149),VLOOKUP(308,TextID,CODE(Language!$B$4)-64,FALSE),\"\"))","v":""},null,{"$f":"IF(E150=\"\",\"\",Report1!I$6)","v":""}]
[null,null,null,{"$f":"IF(E151=\"\",\"\",Customer!E$7)","v":""},null,"","",{"$f":"IF(E151=\"\",\"\",Report1!I$9)","v":""},null,{"$f":"CONCATENATE(IF(AND(E151<>\"\",OR(Report1!I$9=\"\",Report1!J$9=\"\")),VLOOKUP(300,TextID,CODE(Language!$B$4)-64,FALSE),\"\"),IF(AND(E151<>\"\",I151=\"\"),VLOOKUP(302,TextID,CODE(Language!$B$4)-64,FALSE),\"\"),IF(AND(E151=\"\",I151<>\"\"),VLOOKUP(306,TextID,CODE(Language!$B$4)-64,FALSE),\"\"),IF(AND(E151<>\"\",E151=E150),VLOOKUP(308,TextID,CODE(Language!$B$4)-64,FALSE),\"\"))","v":""},null,{"$f":"IF(E151=\"\",\"\",Report1!I$6)","v":""}]
[null,null,null,{"$f":"IF(E152=\"\",\"\",Customer!E$7)","v":""},null,"","",{"$f":"IF(E152=\"\",\"\",Report1!I$9)","v":""},null,{"$f":"CONCATENATE(IF(AND(E152<>\"\",OR(Report1!I$9=\"\",Report1!J$9=\"\")),VLOOKUP(300,TextID,CODE(Language!$B$4)-64,FALSE),\"\"),IF(AND(E152<>\"\",I152=\"\"),VLOOKUP(302,TextID,CODE(Language!$B$4)-64,FALSE),\"\"),IF(AND(E152=\"\",I152<>\"\"),VLOOKUP(306,TextID,CODE(Language!$B$4)-64,FALSE),\"\"),IF(AND(E152<>\"\",E152=E151),VLOOKUP(308,TextID,CODE(Language!$B$4)-64,FALSE),\"\"))","v":""},null,{"$f":"IF(E152=\"\",\"\",Report1!I$6)","v":""}]
[null,null,null,{"$f":"IF(E153=\"\",\"\",Customer!E$7)","v":""},null,"","",{"$f":"IF(E153=\"\",\"\",Report1!I$9)","v":""},null,{"$f":"CONCATENATE(IF(AND(E153<>\"\",OR(Report1!I$9=\"\",Report1!J$9=\"\")),VLOOKUP(300,TextID,CODE(Language!$B$4)-64,FALSE),\"\"),IF(AND(E153<>\"\",I153=\"\"),VLOOKUP(302,TextID,CODE(Language!$B$4)-64,FALSE),\"\"),IF(AND(E153=\"\",I153<>\"\"),VLOOKUP(306,TextID,CODE(Language!$B$4)-64,FALSE),\"\"),IF(AND(E153<>\"\",E153=E152),VLOOKUP(308,TextID,CODE(Language!$B$4)-64,FALSE),\"\"))","v":""},null,{"$f":"IF(E153=\"\",\"\",Report1!I$6)","v":""}]
[null,null,null,{"$f":"IF(E154=\"\",\"\",Customer!E$7)","v":""},null,"","",{"$f":"IF(E154=\"\",\"\",Report1!I$9)","v":""},null,{"$f":"CONCATENATE(IF(AND(E154<>\"\",OR(Report1!I$9=\"\",Report1!J$9=\"\")),VLOOKUP(300,TextID,CODE(Language!$B$4)-64,FALSE),\"\"),IF(AND(E154<>\"\",I154=\"\"),VLOOKUP(302,TextID,CODE(Language!$B$4)-64,FALSE),\"\"),IF(AND(E154=\"\",I154<>\"\"),VLOOKUP(306,TextID,CODE(Language!$B$4)-64,FALSE),\"\"),IF(AND(E154<>\"\",E154=E153),VLOOKUP(308,TextID,CODE(Language!$B$4)-64,FALSE),\"\"))","v":""},null,{"$f":"IF(E154=\"\",\"\",Report1!I$6)","v":""}]
[null,null,null,{"$f":"IF(E155=\"\",\"\",Customer!E$7)","v":""},null,"","",{"$f":"IF(E155=\"\",\"\",Report1!I$9)","v":""},null,{"$f":"CONCATENATE(IF(AND(E155<>\"\",OR(Report1!I$9=\"\",Report1!J$9=\"\")),VLOOKUP(300,TextID,CODE(Language!$B$4)-64,FALSE),\"\"),IF(AND(E155<>\"\",I155=\"\"),VLOOKUP(302,TextID,CODE(Language!$B$4)-64,FALSE),\"\"),IF(AND(E155=\"\",I155<>\"\"),VLOOKUP(306,TextID,CODE(Language!$B$4)-64,FALSE),\"\"),IF(AND(E155<>\"\",E155=E154),VLOOKUP(308,TextID,CODE(Language!$B$4)-64,FALSE),\"\"))","v":""},null,{"$f":"IF(E155=\"\",\"\",Report1!I$6)","v":""}]
[null,null,null,{"$f":"IF(E156=\"\",\"\",Customer!E$7)","v":""},null,"","",{"$f":"IF(E156=\"\",\"\",Report1!I$9)","v":""},null,{"$f":"CONCATENATE(IF(AND(E156<>\"\",OR(Report1!I$9=\"\",Report1!J$9=\"\")),VLOOKUP(300,TextID,CODE(Language!$B$4)-64,FALSE),\"\"),IF(AND(E156<>\"\",I156=\"\"),VLOOKUP(302,TextID,CODE(Language!$B$4)-64,FALSE),\"\"),IF(AND(E156=\"\",I156<>\"\"),VLOOKUP(306,TextID,CODE(Language!$B$4)-64,FALSE),\"\"),IF(AND(E156<>\"\",E156=E155),VLOOKUP(308,TextID,CODE(Language!$B$4)-64,FALSE),\"\"))","v":""},null,{"$f":"IF(E156=\"\",\"\",Report1!I$6)","v":""}]
[null,null,null,{"$f":"IF(E157=\"\",\"\",Customer!E$7)","v":""},null,"","",{"$f":"IF(E157=\"\",\"\",Report1!I$9)","v":""},null,{"$f":"CONCATENATE(IF(AND(E157<>\"\",OR(Report1!I$9=\"\",Report1!J$9=\"\")),VLOOKUP(300,TextID,CODE(Language!$B$4)-64,FALSE),\"\"),IF(AND(E157<>\"\",I157=\"\"),VLOOKUP(302,TextID,CODE(Language!$B$4)-64,FALSE),\"\"),IF(AND(E157=\"\",I157<>\"\"),VLOOKUP(306,TextID,CODE(Language!$B$4)-64,FALSE),\"\"),IF(AND(E157<>\"\",E157=E156),VLOOKUP(308,TextID,CODE(Language!$B$4)-64,FALSE),\"\"))","v":""},null,{"$f":"IF(E157=\"\",\"\",Report1!I$6)","v":""}]
[null,null,null,{"$f":"IF(E158=\"\",\"\",Customer!E$7)","v":""},null,"","",{"$f":"IF(E158=\"\",\"\",Report1!I$9)","v":""},null,{"$f":"CONCATENATE(IF(AND(E158<>\"\",OR(Report1!I$9=\"\",Report1!J$9=\"\")),VLOOKUP(300,TextID,CODE(Language!$B$4)-64,FALSE),\"\"),IF(AND(E158<>\"\",I158=\"\"),VLOOKUP(302,TextID,CODE(Language!$B$4)-64,FALSE),\"\"),IF(AND(E158=\"\",I158<>\"\"),VLOOKUP(306,TextID,CODE(Language!$B$4)-64,FALSE),\"\"),IF(AND(E158<>\"\",E158=E157),VLOOKUP(308,TextID,CODE(Language!$B$4)-64,FALSE),\"\"))","v":""},null,{"$f":"IF(E158=\"\",\"\",Report1!I$6)","v":""}]
[null,null,null,{"$f":"IF(E159=\"\",\"\",Customer!E$7)","v":""},null,"","",{"$f":"IF(E159=\"\",\"\",Report1!I$9)","v":""},null,{"$f":"CONCATENATE(IF(AND(E159<>\"\",OR(Report1!I$9=\"\",Report1!J$9=\"\")),VLOOKUP(300,TextID,CODE(Language!$B$4)-64,FALSE),\"\"),IF(AND(E159<>\"\",I159=\"\"),VLOOKUP(302,TextID,CODE(Language!$B$4)-64,FALSE),\"\"),IF(AND(E159=\"\",I159<>\"\"),VLOOKUP(306,TextID,CODE(Language!$B$4)-64,FALSE),\"\"),IF(AND(E159<>\"\",E159=E158),VLOOKUP(308,TextID,CODE(Language!$B$4)-64,FALSE),\"\"))","v":""},null,{"$f":"IF(E159=\"\",\"\",Report1!I$6)","v":""}]
[null,null,null,{"$f":"IF(E160=\"\",\"\",Customer!E$7)","v":""},null,"","",{"$f":"IF(E160=\"\",\"\",Report1!I$9)","v":""},null,{"$f":"CONCATENATE(IF(AND(E160<>\"\",OR(Report1!I$9=\"\",Report1!J$9=\"\")),VLOOKUP(300,TextID,CODE(Language!$B$4)-64,FALSE),\"\"),IF(AND(E160<>\"\",I160=\"\"),VLOOKUP(302,TextID,CODE(Language!$B$4)-64,FALSE),\"\"),IF(AND(E160=\"\",I160<>\"\"),VLOOKUP(306,TextID,CODE(Language!$B$4)-64,FALSE),\"\"),IF(AND(E160<>\"\",E160=E159),VLOOKUP(308,TextID,CODE(Language!$B$4)-64,FALSE),\"\"))","v":""},null,{"$f":"IF(E160=\"\",\"\",Report1!I$6)","v":""}]
[null,null,null,{"$f":"IF(E161=\"\",\"\",Customer!E$7)","v":""},null,"","",{"$f":"IF(E161=\"\",\"\",Report1!I$9)","v":""},null,{"$f":"CONCATENATE(IF(AND(E161<>\"\",OR(Report1!I$9=\"\",Report1!J$9=\"\")),VLOOKUP(300,TextID,CODE(Language!$B$4)-64,FALSE),\"\"),IF(AND(E161<>\"\",I161=\"\"),VLOOKUP(302,TextID,CODE(Language!$B$4)-64,FALSE),\"\"),IF(AND(E161=\"\",I161<>\"\"),VLOOKUP(306,TextID,CODE(Language!$B$4)-64,FALSE),\"\"),IF(AND(E161<>\"\",E161=E160),VLOOKUP(308,TextID,CODE(Language!$B$4)-64,FALSE),\"\"))","v":""},null,{"$f":"IF(E161=\"\",\"\",Report1!I$6)","v":""}]
[null,null,null,{"$f":"IF(E162=\"\",\"\",Customer!E$7)","v":""},null,"","",{"$f":"IF(E162=\"\",\"\",Report1!I$9)","v":""},null,{"$f":"CONCATENATE(IF(AND(E162<>\"\",OR(Report1!I$9=\"\",Report1!J$9=\"\")),VLOOKUP(300,TextID,CODE(Language!$B$4)-64,FALSE),\"\"),IF(AND(E162<>\"\",I162=\"\"),VLOOKUP(302,TextID,CODE(Language!$B$4)-64,FALSE),\"\"),IF(AND(E162=\"\",I162<>\"\"),VLOOKUP(306,TextID,CODE(Language!$B$4)-64,FALSE),\"\"),IF(AND(E162<>\"\",E162=E161),VLOOKUP(308,TextID,CODE(Language!$B$4)-64,FALSE),\"\"))","v":""},null,{"$f":"IF(E162=\"\",\"\",Report1!I$6)","v":""}]